{"text_format":"1","workbook":"xlsx","n_sheets":11,"sheets":["Current Board","Prior Board","Point View","Tiles Remaining","Tile Availability","Standard Board","Standard Board Slots","Standard Scrabble Tiles","Draw","Standard Board Scores","Scorekeeping"],"not_rendered":{"charts":0,"images":0,"macros":1,"external_links":0,"defined_names":0,"comments":0,"pivot_tables":0},"unopened":[],"bounds":{"document_bytes":16777216,"sheet_cells":100000,"rows_first":2000,"rows_last":500,"rows_between":2000,"halvings":0,"cell_chars":16384,"cell_head_chars":4096},"cells_cut":0,"cells_raw":0,"read":"whole","date_system":"1900"}

{"sheet":"Current Board","index":0,"n_rows":19,"n_cols":30,"rows_kept":19,"cut":false,"hidden":false,"merged":[[1,25,1,26],[1,28,1,29]]}
[]
[null,null,null,null,null,null,null,null,null,null,null,null,null,null,null,null,null,null,null,null,null,null,null,null,null,"MANUAL SCOREKEEPING",null,null,"(CONTINUED)"]
[null,null,null,null,null,null,null,null,null,null,null,null,null,null,null,null,null,"PLAYER 1",null,null,null,null,null,null,null,"Player 1","Player 2",null,"Player 1","Player 2"]
[null,null,null,null,null,null,null,null,null,null,null,null,null,null,null,null,null,null,null,null,null,null,null,null,null,null,null,null,{"$f":"IF(Z17=0,\"\",Z17)","v":""},{"$f":"IF(AA17=0,\"\",AA17)","v":""}]
[null,null,null,null,null,null,null,null,null,null,null,null,null,null,null,null,null,{"$f":"IF(ISNA(VLOOKUP(R6,'Tiles Remaining'!$A:$C,3,FALSE)),\"\",VLOOKUP(R6,'Tiles Remaining'!$A:$C,3,FALSE))","v":""},{"$f":"IF(ISNA(VLOOKUP(S6,'Tiles Remaining'!$A:$C,3,FALSE)),\"\",VLOOKUP(S6,'Tiles Remaining'!$A:$C,3,FALSE))","v":""},{"$f":"IF(ISNA(VLOOKUP(T6,'Tiles Remaining'!$A:$C,3,FALSE)),\"\",VLOOKUP(T6,'Tiles Remaining'!$A:$C,3,FALSE))","v":""},{"$f":"IF(ISNA(VLOOKUP(U6,'Tiles Remaining'!$A:$C,3,FALSE)),\"\",VLOOKUP(U6,'Tiles Remaining'!$A:$C,3,FALSE))","v":""},{"$f":"IF(ISNA(VLOOKUP(V6,'Tiles Remaining'!$A:$C,3,FALSE)),\"\",VLOOKUP(V6,'Tiles Remaining'!$A:$C,3,FALSE))","v":""},{"$f":"IF(ISNA(VLOOKUP(W6,'Tiles Remaining'!$A:$C,3,FALSE)),\"\",VLOOKUP(W6,'Tiles Remaining'!$A:$C,3,FALSE))","v":""},{"$f":"IF(ISNA(VLOOKUP(X6,'Tiles Remaining'!$A:$C,3,FALSE)),\"\",VLOOKUP(X6,'Tiles Remaining'!$A:$C,3,FALSE))","v":""},null,null,null,null,{"$f":"IF(Z18=0,\"\",Z18)","v":""},{"$f":"IF(AA18=0,\"\",AA18)","v":""}]
[null,null,null,null,null,null,null,null,null,null,null,null,null,null,null,null,null,{"$f":"Draw!B13","v":""},{"$f":"Draw!C13","v":""},{"$f":"Draw!D13","v":""},{"$f":"Draw!E13","v":""},{"$f":"Draw!F13","v":""},{"$f":"Draw!G13","v":""},{"$f":"Draw!H13","v":""},null,null,null,null,{"$f":"IF(Z19=0,\"\",Z19)","v":""},""]
[null,null,null,null,null,null,null,null,null,null,null,null,null,null,null,null,null,null,null,null,null,null,null,null,null,null,null,null,{"$f":"IF(Z20=0,\"\",Z20)","v":""},""]
[null,null,null,null,null,null,null,null,null,null,null,null,null,null,null,null,null,"PLAYER 2",null,null,null,null,null,null,null,null,null,null,{"$f":"IF(Z21=0,\"\",Z21)","v":""},""]
[null,null,null,null,null,null,null,null,null,null,null,null,null,null,null,null,null,null,null,null,null,null,null,null,null,null,null,null,{"$f":"IF(Z22=0,\"\",Z22)","v":""},""]
[null,null,null,null,null,null,null,null,null,null,null,null,null,null,null,null,null,{"$f":"IF(ISNA(VLOOKUP(R11,'Tiles Remaining'!$A:$C,3,FALSE)),\"\",VLOOKUP(R11,'Tiles Remaining'!$A:$C,3,FALSE))","v":""},{"$f":"IF(ISNA(VLOOKUP(S11,'Tiles Remaining'!$A:$C,3,FALSE)),\"\",VLOOKUP(S11,'Tiles Remaining'!$A:$C,3,FALSE))","v":""},{"$f":"IF(ISNA(VLOOKUP(T11,'Tiles Remaining'!$A:$C,3,FALSE)),\"\",VLOOKUP(T11,'Tiles Remaining'!$A:$C,3,FALSE))","v":""},{"$f":"IF(ISNA(VLOOKUP(U11,'Tiles Remaining'!$A:$C,3,FALSE)),\"\",VLOOKUP(U11,'Tiles Remaining'!$A:$C,3,FALSE))","v":""},{"$f":"IF(ISNA(VLOOKUP(V11,'Tiles Remaining'!$A:$C,3,FALSE)),\"\",VLOOKUP(V11,'Tiles Remaining'!$A:$C,3,FALSE))","v":""},{"$f":"IF(ISNA(VLOOKUP(W11,'Tiles Remaining'!$A:$C,3,FALSE)),\"\",VLOOKUP(W11,'Tiles Remaining'!$A:$C,3,FALSE))","v":""},{"$f":"IF(ISNA(VLOOKUP(X11,'Tiles Remaining'!$A:$C,3,FALSE)),\"\",VLOOKUP(X11,'Tiles Remaining'!$A:$C,3,FALSE))","v":""},null,null,null,null,{"$f":"IF(Z23=0,\"\",Z23)","v":""},""]
[null,null,null,null,null,null,null,null,null,null,null,null,null,null,null,null,null,{"$f":"Draw!B22","v":""},{"$f":"Draw!C22","v":""},{"$f":"Draw!D22","v":""},{"$f":"Draw!E22","v":""},{"$f":"Draw!F22","v":""},{"$f":"Draw!G22","v":""},{"$f":"Draw!H22","v":""},null,null,null,null,{"$f":"IF(Z24=0,\"\",Z24)","v":""},""]
[null,null,null,null,null,null,null,null,null,null,null,null,null,null,null,null,null,"Current Player:",null,null,null,null,null,null,null,null,null,null,{"$f":"IF(Z25=0,\"\",Z25)","v":""},""]
[null,null,null,null,null,null,null,null,null,null,null,null,null,null,null,null,null,"Tiles Available:",null,null,{"$f":"SUM('Tiles Remaining'!E3:E29)","v":100},null,null,null,null,null,null,null,{"$f":"IF(Z26=0,\"\",Z26)","v":""},""]
[null,null,null,null,null,null,null,null,null,null,null,null,null,null,null,null,null,"Legend:",null,"Triple Word","Double Word","Triple Letter","Double Letter",null,null,null,null,null,{"$f":"IF(Z27=0,\"\",Z27)","v":""},""]
[null,null,null,null,null,null,null,null,null,null,null,null,null,null,null,null,null,null,null,null,null,null,null,null,null,null,null,null,{"$f":"IF(Z28=0,\"\",Z28)","v":""},""]
[null,null,null,null,null,null,null,null,null,null,null,null,null,null,null,null,null,null,null,null,null,null,null,null,null,null,null,null,{"$f":"IF(Z29=0,\"\",Z29)","v":""},""]
[null,null,null,null,null,null,null,null,null,null,null,null,null,null,null,null,null,null,null,null,null,null,null,null,null,null,null,null,{"$f":"SUM(Z4:Z16,AC4:AC16)","v":0},{"$f":"SUM(AA4:AA16,AD4:AD16)","v":0}]
[]
[null,null,null,null,null,null,null,null,null,null,null,null,5]

{"sheet":"Prior Board","index":1,"n_rows":27,"n_cols":48,"rows_kept":27,"cut":false,"hidden":true,"merged":[]}
[null,"Prior Board",null,null,null,null,null,null,null,null,null,null,null,null,null,null,null,"Compare - Value",null,null,null,null,null,null,null,null,null,null,null,null,null,null,null,"Compare - Loc"]
[null,null,null,null,null,null,null,null,null,null,null,null,null,null,null,null,null,{"$f":"IF(B2<>'Current Board'!B2,'Current Board'!B2,\"\")","v":""},{"$f":"IF(C2<>'Current Board'!C2,'Current Board'!C2,\"\")","v":""},{"$f":"IF(D2<>'Current Board'!D2,'Current Board'!D2,\"\")","v":""},{"$f":"IF(E2<>'Current Board'!E2,'Current Board'!E2,\"\")","v":""},{"$f":"IF(F2<>'Current Board'!F2,'Current Board'!F2,\"\")","v":""},{"$f":"IF(G2<>'Current Board'!G2,'Current Board'!G2,\"\")","v":""},{"$f":"IF(H2<>'Current Board'!H2,'Current Board'!H2,\"\")","v":""},{"$f":"IF(I2<>'Current Board'!I2,'Current Board'!I2,\"\")","v":""},{"$f":"IF(J2<>'Current Board'!J2,'Current Board'!J2,\"\")","v":""},{"$f":"IF(K2<>'Current Board'!K2,'Current Board'!K2,\"\")","v":""},{"$f":"IF(L2<>'Current Board'!L2,'Current Board'!L2,\"\")","v":""},{"$f":"IF(M2<>'Current Board'!M2,'Current Board'!M2,\"\")","v":""},{"$f":"IF(N2<>'Current Board'!N2,'Current Board'!N2,\"\")","v":""},{"$f":"IF(O2<>'Current Board'!O2,'Current Board'!O2,\"\")","v":""},{"$f":"IF(P2<>'Current Board'!P2,'Current Board'!P2,\"\")","v":""},null,{"$f":"IF(R2<>\"\",REPLACE(REPLACE(CELL(\"address\",B2),1,1,\"\"),SEARCH(\"$\",REPLACE(CELL(\"address\",B2),1,1,\"\")),1,\"\"),\"\")","v":""},{"$f":"IF(S2<>\"\",REPLACE(REPLACE(CELL(\"address\",C2),1,1,\"\"),SEARCH(\"$\",REPLACE(CELL(\"address\",C2),1,1,\"\")),1,\"\"),\"\")","v":""},"","","","","","","","","","","","",""]
[null,null,null,null,null,null,null,null,null,null,null,null,null,null,null,null,null,{"$f":"IF(B3<>'Current Board'!B3,'Current Board'!B3,\"\")","v":""},{"$f":"IF(C3<>'Current Board'!C3,'Current Board'!C3,\"\")","v":""},{"$f":"IF(D3<>'Current Board'!D3,'Current Board'!D3,\"\")","v":""},{"$f":"IF(E3<>'Current Board'!E3,'Current Board'!E3,\"\")","v":""},{"$f":"IF(F3<>'Current Board'!F3,'Current Board'!F3,\"\")","v":""},{"$f":"IF(G3<>'Current Board'!G3,'Current Board'!G3,\"\")","v":""},{"$f":"IF(H3<>'Current Board'!H3,'Current Board'!H3,\"\")","v":""},{"$f":"IF(I3<>'Current Board'!I3,'Current Board'!I3,\"\")","v":""},{"$f":"IF(J3<>'Current Board'!J3,'Current Board'!J3,\"\")","v":""},{"$f":"IF(K3<>'Current Board'!K3,'Current Board'!K3,\"\")","v":""},{"$f":"IF(L3<>'Current Board'!L3,'Current Board'!L3,\"\")","v":""},{"$f":"IF(M3<>'Current Board'!M3,'Current Board'!M3,\"\")","v":""},{"$f":"IF(N3<>'Current Board'!N3,'Current Board'!N3,\"\")","v":""},{"$f":"IF(O3<>'Current Board'!O3,'Current Board'!O3,\"\")","v":""},{"$f":"IF(P3<>'Current Board'!P3,'Current Board'!P3,\"\")","v":""},null,{"$f":"IF(R3<>\"\",REPLACE(REPLACE(CELL(\"address\",B3),1,1,\"\"),SEARCH(\"$\",REPLACE(CELL(\"address\",B3),1,1,\"\")),1,\"\"),\"\")","v":""},{"$f":"IF(S3<>\"\",REPLACE(REPLACE(CELL(\"address\",C3),1,1,\"\"),SEARCH(\"$\",REPLACE(CELL(\"address\",C3),1,1,\"\")),1,\"\"),\"\")","v":""},{"$f":"IF(T3<>\"\",REPLACE(REPLACE(CELL(\"address\",D3),1,1,\"\"),SEARCH(\"$\",REPLACE(CELL(\"address\",D3),1,1,\"\")),1,\"\"),\"\")","v":""},{"$f":"IF(U3<>\"\",REPLACE(REPLACE(CELL(\"address\",E3),1,1,\"\"),SEARCH(\"$\",REPLACE(CELL(\"address\",E3),1,1,\"\")),1,\"\"),\"\")","v":""},{"$f":"IF(V3<>\"\",REPLACE(REPLACE(CELL(\"address\",F3),1,1,\"\"),SEARCH(\"$\",REPLACE(CELL(\"address\",F3),1,1,\"\")),1,\"\"),\"\")","v":""},{"$f":"IF(W3<>\"\",REPLACE(REPLACE(CELL(\"address\",G3),1,1,\"\"),SEARCH(\"$\",REPLACE(CELL(\"address\",G3),1,1,\"\")),1,\"\"),\"\")","v":""},{"$f":"IF(X3<>\"\",REPLACE(REPLACE(CELL(\"address\",H3),1,1,\"\"),SEARCH(\"$\",REPLACE(CELL(\"address\",H3),1,1,\"\")),1,\"\"),\"\")","v":""},{"$f":"IF(Y3<>\"\",REPLACE(REPLACE(CELL(\"address\",I3),1,1,\"\"),SEARCH(\"$\",REPLACE(CELL(\"address\",I3),1,1,\"\")),1,\"\"),\"\")","v":""},{"$f":"IF(Z3<>\"\",REPLACE(REPLACE(CELL(\"address\",J3),1,1,\"\"),SEARCH(\"$\",REPLACE(CELL(\"address\",J3),1,1,\"\")),1,\"\"),\"\")","v":""},{"$f":"IF(AA3<>\"\",REPLACE(REPLACE(CELL(\"address\",K3),1,1,\"\"),SEARCH(\"$\",REPLACE(CELL(\"address\",K3),1,1,\"\")),1,\"\"),\"\")","v":""},{"$f":"IF(AB3<>\"\",REPLACE(REPLACE(CELL(\"address\",L3),1,1,\"\"),SEARCH(\"$\",REPLACE(CELL(\"address\",L3),1,1,\"\")),1,\"\"),\"\")","v":""},{"$f":"IF(AC3<>\"\",REPLACE(REPLACE(CELL(\"address\",M3),1,1,\"\"),SEARCH(\"$\",REPLACE(CELL(\"address\",M3),1,1,\"\")),1,\"\"),\"\")","v":""},{"$f":"IF(AD3<>\"\",REPLACE(REPLACE(CELL(\"address\",N3),1,1,\"\"),SEARCH(\"$\",REPLACE(CELL(\"address\",N3),1,1,\"\")),1,\"\"),\"\")","v":""},{"$f":"IF(AE3<>\"\",REPLACE(REPLACE(CELL(\"address\",O3),1,1,\"\"),SEARCH(\"$\",REPLACE(CELL(\"address\",O3),1,1,\"\")),1,\"\"),\"\")","v":""},{"$f":"IF(AF3<>\"\",REPLACE(REPLACE(CELL(\"address\",P3),1,1,\"\"),SEARCH(\"$\",REPLACE(CELL(\"address\",P3),1,1,\"\")),1,\"\"),\"\")","v":""}]
[null,null,null,null,null,null,null,null,null,null,null,null,null,null,null,null,null,{"$f":"IF(B4<>'Current Board'!B4,'Current Board'!B4,\"\")","v":""},{"$f":"IF(C4<>'Current Board'!C4,'Current Board'!C4,\"\")","v":""},{"$f":"IF(D4<>'Current Board'!D4,'Current Board'!D4,\"\")","v":""},{"$f":"IF(E4<>'Current Board'!E4,'Current Board'!E4,\"\")","v":""},{"$f":"IF(F4<>'Current Board'!F4,'Current Board'!F4,\"\")","v":""},{"$f":"IF(G4<>'Current Board'!G4,'Current Board'!G4,\"\")","v":""},{"$f":"IF(H4<>'Current Board'!H4,'Current Board'!H4,\"\")","v":""},{"$f":"IF(I4<>'Current Board'!I4,'Current Board'!I4,\"\")","v":""},{"$f":"IF(J4<>'Current Board'!J4,'Current Board'!J4,\"\")","v":""},{"$f":"IF(K4<>'Current Board'!K4,'Current Board'!K4,\"\")","v":""},{"$f":"IF(L4<>'Current Board'!L4,'Current Board'!L4,\"\")","v":""},{"$f":"IF(M4<>'Current Board'!M4,'Current Board'!M4,\"\")","v":""},{"$f":"IF(N4<>'Current Board'!N4,'Current Board'!N4,\"\")","v":""},{"$f":"IF(O4<>'Current Board'!O4,'Current Board'!O4,\"\")","v":""},{"$f":"IF(P4<>'Current Board'!P4,'Current Board'!P4,\"\")","v":""},null,"","","","","","","","","","","","","","",""]
[null,null,null,null,null,null,null,null,null,null,null,null,null,null,null,null,null,{"$f":"IF(B5<>'Current Board'!B5,'Current Board'!B5,\"\")","v":""},{"$f":"IF(C5<>'Current Board'!C5,'Current Board'!C5,\"\")","v":""},{"$f":"IF(D5<>'Current Board'!D5,'Current Board'!D5,\"\")","v":""},{"$f":"IF(E5<>'Current Board'!E5,'Current Board'!E5,\"\")","v":""},{"$f":"IF(F5<>'Current Board'!F5,'Current Board'!F5,\"\")","v":""},{"$f":"IF(G5<>'Current Board'!G5,'Current Board'!G5,\"\")","v":""},{"$f":"IF(H5<>'Current Board'!H5,'Current Board'!H5,\"\")","v":""},{"$f":"IF(I5<>'Current Board'!I5,'Current Board'!I5,\"\")","v":""},{"$f":"IF(J5<>'Current Board'!J5,'Current Board'!J5,\"\")","v":""},{"$f":"IF(K5<>'Current Board'!K5,'Current Board'!K5,\"\")","v":""},{"$f":"IF(L5<>'Current Board'!L5,'Current Board'!L5,\"\")","v":""},{"$f":"IF(M5<>'Current Board'!M5,'Current Board'!M5,\"\")","v":""},{"$f":"IF(N5<>'Current Board'!N5,'Current Board'!N5,\"\")","v":""},{"$f":"IF(O5<>'Current Board'!O5,'Current Board'!O5,\"\")","v":""},{"$f":"IF(P5<>'Current Board'!P5,'Current Board'!P5,\"\")","v":""},null,"","","","","","","","","","","","","","",""]
[null,null,null,null,null,null,null,null,null,null,null,null,null,null,null,null,null,{"$f":"IF(B6<>'Current Board'!B6,'Current Board'!B6,\"\")","v":""},{"$f":"IF(C6<>'Current Board'!C6,'Current Board'!C6,\"\")","v":""},{"$f":"IF(D6<>'Current Board'!D6,'Current Board'!D6,\"\")","v":""},{"$f":"IF(E6<>'Current Board'!E6,'Current Board'!E6,\"\")","v":""},{"$f":"IF(F6<>'Current Board'!F6,'Current Board'!F6,\"\")","v":""},{"$f":"IF(G6<>'Current Board'!G6,'Current Board'!G6,\"\")","v":""},{"$f":"IF(H6<>'Current Board'!H6,'Current Board'!H6,\"\")","v":""},{"$f":"IF(I6<>'Current Board'!I6,'Current Board'!I6,\"\")","v":""},{"$f":"IF(J6<>'Current Board'!J6,'Current Board'!J6,\"\")","v":""},{"$f":"IF(K6<>'Current Board'!K6,'Current Board'!K6,\"\")","v":""},{"$f":"IF(L6<>'Current Board'!L6,'Current Board'!L6,\"\")","v":""},{"$f":"IF(M6<>'Current Board'!M6,'Current Board'!M6,\"\")","v":""},{"$f":"IF(N6<>'Current Board'!N6,'Current Board'!N6,\"\")","v":""},{"$f":"IF(O6<>'Current Board'!O6,'Current Board'!O6,\"\")","v":""},{"$f":"IF(P6<>'Current Board'!P6,'Current Board'!P6,\"\")","v":""},null,"","","","","","","","","","","","","","",""]
[null,null,null,null,null,null,null,null,null,null,null,null,null,null,null,null,null,{"$f":"IF(B7<>'Current Board'!B7,'Current Board'!B7,\"\")","v":""},{"$f":"IF(C7<>'Current Board'!C7,'Current Board'!C7,\"\")","v":""},{"$f":"IF(D7<>'Current Board'!D7,'Current Board'!D7,\"\")","v":""},{"$f":"IF(E7<>'Current Board'!E7,'Current Board'!E7,\"\")","v":""},{"$f":"IF(F7<>'Current Board'!F7,'Current Board'!F7,\"\")","v":""},{"$f":"IF(G7<>'Current Board'!G7,'Current Board'!G7,\"\")","v":""},{"$f":"IF(H7<>'Current Board'!H7,'Current Board'!H7,\"\")","v":""},{"$f":"IF(I7<>'Current Board'!I7,'Current Board'!I7,\"\")","v":""},{"$f":"IF(J7<>'Current Board'!J7,'Current Board'!J7,\"\")","v":""},{"$f":"IF(K7<>'Current Board'!K7,'Current Board'!K7,\"\")","v":""},{"$f":"IF(L7<>'Current Board'!L7,'Current Board'!L7,\"\")","v":""},{"$f":"IF(M7<>'Current Board'!M7,'Current Board'!M7,\"\")","v":""},{"$f":"IF(N7<>'Current Board'!N7,'Current Board'!N7,\"\")","v":""},{"$f":"IF(O7<>'Current Board'!O7,'Current Board'!O7,\"\")","v":""},{"$f":"IF(P7<>'Current Board'!P7,'Current Board'!P7,\"\")","v":""},null,"","","","","","","","","","","","","","",""]
[null,null,null,null,null,null,null,null,null,null,null,null,null,null,null,null,null,{"$f":"IF(B8<>'Current Board'!B8,'Current Board'!B8,\"\")","v":""},{"$f":"IF(C8<>'Current Board'!C8,'Current Board'!C8,\"\")","v":""},{"$f":"IF(D8<>'Current Board'!D8,'Current Board'!D8,\"\")","v":""},{"$f":"IF(E8<>'Current Board'!E8,'Current Board'!E8,\"\")","v":""},{"$f":"IF(F8<>'Current Board'!F8,'Current Board'!F8,\"\")","v":""},{"$f":"IF(G8<>'Current Board'!G8,'Current Board'!G8,\"\")","v":""},{"$f":"IF(H8<>'Current Board'!H8,'Current Board'!H8,\"\")","v":""},{"$f":"IF(I8<>'Current Board'!I8,'Current Board'!I8,\"\")","v":""},{"$f":"IF(J8<>'Current Board'!J8,'Current Board'!J8,\"\")","v":""},{"$f":"IF(K8<>'Current Board'!K8,'Current Board'!K8,\"\")","v":""},{"$f":"IF(L8<>'Current Board'!L8,'Current Board'!L8,\"\")","v":""},{"$f":"IF(M8<>'Current Board'!M8,'Current Board'!M8,\"\")","v":""},{"$f":"IF(N8<>'Current Board'!N8,'Current Board'!N8,\"\")","v":""},{"$f":"IF(O8<>'Current Board'!O8,'Current Board'!O8,\"\")","v":""},{"$f":"IF(P8<>'Current Board'!P8,'Current Board'!P8,\"\")","v":""},null,"","","","","","","","","","","","","","",""]
[null,null,null,null,null,null,null,null,null,null,null,null,null,null,null,null,null,{"$f":"IF(B9<>'Current Board'!B9,'Current Board'!B9,\"\")","v":""},{"$f":"IF(C9<>'Current Board'!C9,'Current Board'!C9,\"\")","v":""},{"$f":"IF(D9<>'Current Board'!D9,'Current Board'!D9,\"\")","v":""},{"$f":"IF(E9<>'Current Board'!E9,'Current Board'!E9,\"\")","v":""},{"$f":"IF(F9<>'Current Board'!F9,'Current Board'!F9,\"\")","v":""},{"$f":"IF(G9<>'Current Board'!G9,'Current Board'!G9,\"\")","v":""},{"$f":"IF(H9<>'Current Board'!H9,'Current Board'!H9,\"\")","v":""},{"$f":"IF(I9<>'Current Board'!I9,'Current Board'!I9,\"\")","v":""},{"$f":"IF(J9<>'Current Board'!J9,'Current Board'!J9,\"\")","v":""},{"$f":"IF(K9<>'Current Board'!K9,'Current Board'!K9,\"\")","v":""},{"$f":"IF(L9<>'Current Board'!L9,'Current Board'!L9,\"\")","v":""},{"$f":"IF(M9<>'Current Board'!M9,'Current Board'!M9,\"\")","v":""},{"$f":"IF(N9<>'Current Board'!N9,'Current Board'!N9,\"\")","v":""},{"$f":"IF(O9<>'Current Board'!O9,'Current Board'!O9,\"\")","v":""},{"$f":"IF(P9<>'Current Board'!P9,'Current Board'!P9,\"\")","v":""},null,"","","","","","","","","","","","","","",""]
[null,null,null,null,null,null,null,null,null,null,null,null,null,null,null,null,null,{"$f":"IF(B10<>'Current Board'!B10,'Current Board'!B10,\"\")","v":""},{"$f":"IF(C10<>'Current Board'!C10,'Current Board'!C10,\"\")","v":""},{"$f":"IF(D10<>'Current Board'!D10,'Current Board'!D10,\"\")","v":""},{"$f":"IF(E10<>'Current Board'!E10,'Current Board'!E10,\"\")","v":""},{"$f":"IF(F10<>'Current Board'!F10,'Current Board'!F10,\"\")","v":""},{"$f":"IF(G10<>'Current Board'!G10,'Current Board'!G10,\"\")","v":""},{"$f":"IF(H10<>'Current Board'!H10,'Current Board'!H10,\"\")","v":""},{"$f":"IF(I10<>'Current Board'!I10,'Current Board'!I10,\"\")","v":""},{"$f":"IF(J10<>'Current Board'!J10,'Current Board'!J10,\"\")","v":""},{"$f":"IF(K10<>'Current Board'!K10,'Current Board'!K10,\"\")","v":""},{"$f":"IF(L10<>'Current Board'!L10,'Current Board'!L10,\"\")","v":""},{"$f":"IF(M10<>'Current Board'!M10,'Current Board'!M10,\"\")","v":""},{"$f":"IF(N10<>'Current Board'!N10,'Current Board'!N10,\"\")","v":""},{"$f":"IF(O10<>'Current Board'!O10,'Current Board'!O10,\"\")","v":""},{"$f":"IF(P10<>'Current Board'!P10,'Current Board'!P10,\"\")","v":""},null,"","","","","","","","","","","","","","",""]
[null,null,null,null,null,null,null,null,null,null,null,null,null,null,null,null,null,{"$f":"IF(B11<>'Current Board'!B11,'Current Board'!B11,\"\")","v":""},{"$f":"IF(C11<>'Current Board'!C11,'Current Board'!C11,\"\")","v":""},{"$f":"IF(D11<>'Current Board'!D11,'Current Board'!D11,\"\")","v":""},{"$f":"IF(E11<>'Current Board'!E11,'Current Board'!E11,\"\")","v":""},{"$f":"IF(F11<>'Current Board'!F11,'Current Board'!F11,\"\")","v":""},{"$f":"IF(G11<>'Current Board'!G11,'Current Board'!G11,\"\")","v":""},{"$f":"IF(H11<>'Current Board'!H11,'Current Board'!H11,\"\")","v":""},{"$f":"IF(I11<>'Current Board'!I11,'Current Board'!I11,\"\")","v":""},{"$f":"IF(J11<>'Current Board'!J11,'Current Board'!J11,\"\")","v":""},{"$f":"IF(K11<>'Current Board'!K11,'Current Board'!K11,\"\")","v":""},{"$f":"IF(L11<>'Current Board'!L11,'Current Board'!L11,\"\")","v":""},{"$f":"IF(M11<>'Current Board'!M11,'Current Board'!M11,\"\")","v":""},{"$f":"IF(N11<>'Current Board'!N11,'Current Board'!N11,\"\")","v":""},{"$f":"IF(O11<>'Current Board'!O11,'Current Board'!O11,\"\")","v":""},{"$f":"IF(P11<>'Current Board'!P11,'Current Board'!P11,\"\")","v":""},null,"","","","","","","","","","","","","","",""]
[null,null,null,null,null,null,null,null,null,null,null,null,null,null,null,null,null,{"$f":"IF(B12<>'Current Board'!B12,'Current Board'!B12,\"\")","v":""},{"$f":"IF(C12<>'Current Board'!C12,'Current Board'!C12,\"\")","v":""},{"$f":"IF(D12<>'Current Board'!D12,'Current Board'!D12,\"\")","v":""},{"$f":"IF(E12<>'Current Board'!E12,'Current Board'!E12,\"\")","v":""},{"$f":"IF(F12<>'Current Board'!F12,'Current Board'!F12,\"\")","v":""},{"$f":"IF(G12<>'Current Board'!G12,'Current Board'!G12,\"\")","v":""},{"$f":"IF(H12<>'Current Board'!H12,'Current Board'!H12,\"\")","v":""},{"$f":"IF(I12<>'Current Board'!I12,'Current Board'!I12,\"\")","v":""},{"$f":"IF(J12<>'Current Board'!J12,'Current Board'!J12,\"\")","v":""},{"$f":"IF(K12<>'Current Board'!K12,'Current Board'!K12,\"\")","v":""},{"$f":"IF(L12<>'Current Board'!L12,'Current Board'!L12,\"\")","v":""},{"$f":"IF(M12<>'Current Board'!M12,'Current Board'!M12,\"\")","v":""},{"$f":"IF(N12<>'Current Board'!N12,'Current Board'!N12,\"\")","v":""},{"$f":"IF(O12<>'Current Board'!O12,'Current Board'!O12,\"\")","v":""},{"$f":"IF(P12<>'Current Board'!P12,'Current Board'!P12,\"\")","v":""},null,"","","","","","","","","","","","","","",""]
[null,null,null,null,null,null,null,null,null,null,null,null,null,null,null,null,null,{"$f":"IF(B13<>'Current Board'!B13,'Current Board'!B13,\"\")","v":""},{"$f":"IF(C13<>'Current Board'!C13,'Current Board'!C13,\"\")","v":""},{"$f":"IF(D13<>'Current Board'!D13,'Current Board'!D13,\"\")","v":""},{"$f":"IF(E13<>'Current Board'!E13,'Current Board'!E13,\"\")","v":""},{"$f":"IF(F13<>'Current Board'!F13,'Current Board'!F13,\"\")","v":""},{"$f":"IF(G13<>'Current Board'!G13,'Current Board'!G13,\"\")","v":""},{"$f":"IF(H13<>'Current Board'!H13,'Current Board'!H13,\"\")","v":""},{"$f":"IF(I13<>'Current Board'!I13,'Current Board'!I13,\"\")","v":""},{"$f":"IF(J13<>'Current Board'!J13,'Current Board'!J13,\"\")","v":""},{"$f":"IF(K13<>'Current Board'!K13,'Current Board'!K13,\"\")","v":""},{"$f":"IF(L13<>'Current Board'!L13,'Current Board'!L13,\"\")","v":""},{"$f":"IF(M13<>'Current Board'!M13,'Current Board'!M13,\"\")","v":""},{"$f":"IF(N13<>'Current Board'!N13,'Current Board'!N13,\"\")","v":""},{"$f":"IF(O13<>'Current Board'!O13,'Current Board'!O13,\"\")","v":""},{"$f":"IF(P13<>'Current Board'!P13,'Current Board'!P13,\"\")","v":""},null,"","","","","","","","","","","","","","",""]
[null,null,null,null,null,null,null,null,null,null,null,null,null,null,null,null,null,{"$f":"IF(B14<>'Current Board'!B14,'Current Board'!B14,\"\")","v":""},{"$f":"IF(C14<>'Current Board'!C14,'Current Board'!C14,\"\")","v":""},{"$f":"IF(D14<>'Current Board'!D14,'Current Board'!D14,\"\")","v":""},{"$f":"IF(E14<>'Current Board'!E14,'Current Board'!E14,\"\")","v":""},{"$f":"IF(F14<>'Current Board'!F14,'Current Board'!F14,\"\")","v":""},{"$f":"IF(G14<>'Current Board'!G14,'Current Board'!G14,\"\")","v":""},{"$f":"IF(H14<>'Current Board'!H14,'Current Board'!H14,\"\")","v":""},{"$f":"IF(I14<>'Current Board'!I14,'Current Board'!I14,\"\")","v":""},{"$f":"IF(J14<>'Current Board'!J14,'Current Board'!J14,\"\")","v":""},{"$f":"IF(K14<>'Current Board'!K14,'Current Board'!K14,\"\")","v":""},{"$f":"IF(L14<>'Current Board'!L14,'Current Board'!L14,\"\")","v":""},{"$f":"IF(M14<>'Current Board'!M14,'Current Board'!M14,\"\")","v":""},{"$f":"IF(N14<>'Current Board'!N14,'Current Board'!N14,\"\")","v":""},{"$f":"IF(O14<>'Current Board'!O14,'Current Board'!O14,\"\")","v":""},{"$f":"IF(P14<>'Current Board'!P14,'Current Board'!P14,\"\")","v":""},null,"","","","","","","","","","","","","","",""]
[null,null,null,null,null,null,null,null,null,null,null,null,null,null,null,null,null,{"$f":"IF(B15<>'Current Board'!B15,'Current Board'!B15,\"\")","v":""},{"$f":"IF(C15<>'Current Board'!C15,'Current Board'!C15,\"\")","v":""},{"$f":"IF(D15<>'Current Board'!D15,'Current Board'!D15,\"\")","v":""},{"$f":"IF(E15<>'Current Board'!E15,'Current Board'!E15,\"\")","v":""},{"$f":"IF(F15<>'Current Board'!F15,'Current Board'!F15,\"\")","v":""},{"$f":"IF(G15<>'Current Board'!G15,'Current Board'!G15,\"\")","v":""},{"$f":"IF(H15<>'Current Board'!H15,'Current Board'!H15,\"\")","v":""},{"$f":"IF(I15<>'Current Board'!I15,'Current Board'!I15,\"\")","v":""},{"$f":"IF(J15<>'Current Board'!J15,'Current Board'!J15,\"\")","v":""},{"$f":"IF(K15<>'Current Board'!K15,'Current Board'!K15,\"\")","v":""},{"$f":"IF(L15<>'Current Board'!L15,'Current Board'!L15,\"\")","v":""},{"$f":"IF(M15<>'Current Board'!M15,'Current Board'!M15,\"\")","v":""},{"$f":"IF(N15<>'Current Board'!N15,'Current Board'!N15,\"\")","v":""},{"$f":"IF(O15<>'Current Board'!O15,'Current Board'!O15,\"\")","v":""},{"$f":"IF(P15<>'Current Board'!P15,'Current Board'!P15,\"\")","v":""},null,"","","","","","","","","","","","","","",""]
[null,null,null,null,null,null,null,null,null,null,null,null,null,null,null,null,null,{"$f":"IF(B16<>'Current Board'!B16,'Current Board'!B16,\"\")","v":""},{"$f":"IF(C16<>'Current Board'!C16,'Current Board'!C16,\"\")","v":""},{"$f":"IF(D16<>'Current Board'!D16,'Current Board'!D16,\"\")","v":""},{"$f":"IF(E16<>'Current Board'!E16,'Current Board'!E16,\"\")","v":""},{"$f":"IF(F16<>'Current Board'!F16,'Current Board'!F16,\"\")","v":""},{"$f":"IF(G16<>'Current Board'!G16,'Current Board'!G16,\"\")","v":""},{"$f":"IF(H16<>'Current Board'!H16,'Current Board'!H16,\"\")","v":""},{"$f":"IF(I16<>'Current Board'!I16,'Current Board'!I16,\"\")","v":""},{"$f":"IF(J16<>'Current Board'!J16,'Current Board'!J16,\"\")","v":""},{"$f":"IF(K16<>'Current Board'!K16,'Current Board'!K16,\"\")","v":""},{"$f":"IF(L16<>'Current Board'!L16,'Current Board'!L16,\"\")","v":""},{"$f":"IF(M16<>'Current Board'!M16,'Current Board'!M16,\"\")","v":""},{"$f":"IF(N16<>'Current Board'!N16,'Current Board'!N16,\"\")","v":""},{"$f":"IF(O16<>'Current Board'!O16,'Current Board'!O16,\"\")","v":""},{"$f":"IF(P16<>'Current Board'!P16,'Current Board'!P16,\"\")","v":""},null,"","","","","","","","","","","","","","",""]
[null,null,null,null,null,null,null,null,null,null,null,null,null,null,null,null,null,"Concatenated",null,null,{"$f":"CONCATENATE(R2,R3,R4,R5,R6,R7,R8,R9,R10,R11,R12,R13,R14,R15,R16,S2,S3,S4,S5,S6,S7,S8,S9,S10,S11,S12,S13,S14,S15,S16)","v":""},{"$f":"CONCATENATE(T2,T3,T4,T5,T6,T7,T8,T9,T10,T11,T12,T13,T14,T15,T16,U2,U3,U4,U5,U6,U7,U8,U9,U10,U11,U12,U13,U14,U15,U16)","v":""},{"$f":"CONCATENATE(V2,V3,V4,V5,V6,V7,V8,V9,V10,V11,V12,V13,V14,V15,V16,W2,W3,W4,W5,W6,W7,W8,W9,W10,W11,W12,W13,W14,W15,W16)","v":""},{"$f":"CONCATENATE(X2,X3,X4,X5,X6,X7,X8,X9,X10,X11,X12,X13,X14,X15,X16,Y2,Y3,Y4,Y5,Y6,Y7,Y8,Y9,Y10,Y11,Y12,Y13,Y14,Y15,Y16)","v":""},{"$f":"CONCATENATE(Z2,Z3,Z4,Z5,Z6,Z7,Z8,Z9,Z10,Z11,Z12,Z13,Z14,Z15,Z16,AA2,AA3,AA4,AA5,AA6,AA7,AA8,AA9,AA10,AA11,AA12,AA13,AA14,AA15,AA16)","v":""},{"$f":"CONCATENATE(AB2,AB3,AB4,AB5,AB6,AB7,AB8,AB9,AB10,AB11,AB12,AB13,AB14,AB15,AB16,AC2,AC3,AC4,AC5,AC6,AC7,AC8,AC9,AC10,AC11,AC12,AC13,AC14,AC15,AC16)","v":""},{"$f":"CONCATENATE(AD2,AD3,AD4,AD5,AD6,AD7,AD8,AD9,AD10,AD11,AD12,AD13,AD14,AD15,AD16,AE2,AE3,AE4,AE5,AE6,AE7,AE8,AE9,AE10,AE11,AE12,AE13,AE14,AE15,AE16)","v":""},{"$f":"CONCATENATE(AF2,AF3,AF4,AF5,AF6,AF7,AF8,AF9,AF10,AF11,AF12,AF13,AF14,AF15,AF16)","v":""},{"$f":"CONCATENATE(U17, V17,W17,X17,Y17,Z17,AA17,AB17)","v":""},{"$f":"AC17","v":""},{"$f":"IF(ISERROR(SEARCH(\"!\",AD17))=TRUE,AD17,REPLACE(AD17,SEARCH(\"!\",AD17)+1,1,\"\"))","v":""},{"$f":"IF(ISERROR(REPLACE(AE17,SEARCH(\"!\",REPLACE(AD17,SEARCH(\"!\",AD17),1,\"\"))+1,1,\"\"))=TRUE,AE17,REPLACE(AE17,SEARCH(\"!\",REPLACE(AD17,SEARCH(\"!\",AD17),1,\"\"))+1,1,\"\"))","v":""},null,"Concatenated",null,null,{"$f":"CONCATENATE(AH2,AH3,AH4,AH5,AH6,AH7,AH8,AH9,AH10,AH11,AH12,AH13,AH14,AH15,AH16,AI2,AI3,AI4,AI5,AI6,AI7,AI8,AI9,AI10,AI11,AI12,AI13,AI14,AI15,AI16)","v":""},{"$f":"CONCATENATE(AJ2,AJ3,AJ4,AJ5,AJ6,AJ7,AJ8,AJ9,AJ10,AJ11,AJ12,AJ13,AJ14,AJ15,AJ16,AK2,AK3,AK4,AK5,AK6,AK7,AK8,AK9,AK10,AK11,AK12,AK13,AK14,AK15,AK16)","v":""},{"$f":"CONCATENATE(AL2,AL3,AL4,AL5,AL6,AL7,AL8,AL9,AL10,AL11,AL12,AL13,AL14,AL15,AL16,AM2,AM3,AM4,AM5,AM6,AM7,AM8,AM9,AM10,AM11,AM12,AM13,AM14,AM15,AM16)","v":""},{"$f":"CONCATENATE(AN2,AN3,AN4,AN5,AN6,AN7,AN8,AN9,AN10,AN11,AN12,AN13,AN14,AN15,AN16,AO2,AO3,AO4,AO5,AO6,AO7,AO8,AO9,AO10,AO11,AO12,AO13,AO14,AO15,AO16)","v":""},{"$f":"CONCATENATE(AP2,AP3,AP4,AP5,AP6,AP7,AP8,AP9,AP10,AP11,AP12,AP13,AP14,AP15,AP16,AQ2,AQ3,AQ4,AQ5,AQ6,AQ7,AQ8,AQ9,AQ10,AQ11,AQ12,AQ13,AQ14,AQ15,AQ16)","v":""},{"$f":"CONCATENATE(AR2,AR3,AR4,AR5,AR6,AR7,AR8,AR9,AR10,AR11,AR12,AR13,AR14,AR15,AR16,AS2,AS3,AS4,AS5,AS6,AS7,AS8,AS9,AS10,AS11,AS12,AS13,AS14,AS15,AS16)","v":""},{"$f":"CONCATENATE(AT2,AT3,AT4,AT5,AT6,AT7,AT8,AT9,AT10,AT11,AT12,AT13,AT14,AT15,AT16,AU2,AU3,AU4,AU5,AU6,AU7,AU8,AU9,AU10,AU11,AU12,AU13,AU14,AU15,AU16)","v":""},{"$f":"CONCATENATE(AV2,AV3,AV4,AV5,AV6,AV7,AV8,AV9,AV10,AV11,AV12,AV13,AV14,AV15,AV16)","v":""},{"$f":"CONCATENATE(AK17,AL17,AM17,AN17,AO17,AP17,AQ17,AR17)","v":""},{"$f":"AS17","v":""}]
[null,null,null,null,null,null,null,null,null,null,null,null,null,null,null,null,null,"Length",null,null,null,{"$f":"LEN(AF17)","v":0}]
[null,null,null,null,null,null,null,null,null,null,null,null,null,null,null,null,null,1,2,3,4,5,6,7,null,null,null,null,null,null,null,null,null,1,2,3,4,5,6,7]
[null,null,null,null,null,null,null,null,null,null,null,null,null,null,null,"New",null,{"$f":"IF(R19<=$V$18,MID($AF$17,R19,1),\"\")","v":""},"","","","","","",null,null,null,null,null,null,null,"New",null,{"$f":"IF(ISNUMBER(VALUE(MID(AT17,3,1))),LEFT(AT17,3),LEFT(AT17,2))","v":""},{"$f":"IF(ISNUMBER(VALUE(MID(AH21,3,1))),LEFT(AH21,3),LEFT(AH21,2))","v":""},{"$f":"IF(ISNUMBER(VALUE(MID(AI21,3,1))),LEFT(AI21,3),LEFT(AI21,2))","v":""},"","","",""]
[null,null,null,null,null,null,null,null,null,null,null,null,null,null,null,"Ordered",null,{"$f":"IF(R22<>\"\",IF($R20=R22,R22,IF($S20=R22,R22,IF($T20=R22,R22,IF($U20=R22,R22,IF($V20=R22,R22,IF($W20=R22,R22,IF($X20=R22,R22,\"\"))))))),\"\")","v":""},{"$f":"IF(S27<=COUNTIF($R$20:$X$20,S22),IF($R20=S22,S22,IF($S20=S22,S22,IF($T20=S22,S22,IF($U20=S22,S22,IF($V20=S22,S22,IF($W20=S22,S22,IF($X20=S22,S22,\"\"))))))),\"\")","v":""},"","","","","",null,null,null,null,null,null,null,"Remainder",null,{"$f":"IF(LEN(AH20)=2,REPLACE(AT17,1,2,\"\"),REPLACE(AT17,1,3,\"\"))","v":""},{"$f":"IF(LEN(AI20)=2,REPLACE(AH21,1,2,\"\"),REPLACE(AH21,1,3,\"\"))","v":""},{"$f":"IF(LEN(AJ20)=2,REPLACE(AI21,1,2,\"\"),REPLACE(AI21,1,3,\"\"))","v":""},"","","",""]
[null,null,null,null,null,null,null,null,null,null,null,null,null,null,null,"Orig"]
[null,null,null,null,null,null,null,null,null,null,null,null,null,null,null,"Net",null,{"$f":"IF(R22=R21,\"\",R22)","v":""},{"$f":"IF(S22=S21,\"\",S22)","v":""},"","","","",""]
[null,null,null,null,null,null,null,null,null,null,null,null,null,null,null,"Check 1",null,{"$f":"IF(R20<>\"\",IF(R20=$R$22,\"OK\",IF(R20=$S$22,\"OK\",IF(R20=$T$22,\"OK\",IF(R20=$U$22,\"OK\",IF(R20=$V$22,\"OK\",IF(R20=$W$22,\"OK\",IF(R20=$X$22,\"OK\",\"X\"))))))),\"\")","v":""},{"$f":"IF(S20<>\"\",IF(S20=$R$22,\"OK\",IF(S20=$S$22,\"OK\",IF(S20=$T$22,\"OK\",IF(S20=$U$22,\"OK\",IF(S20=$V$22,\"OK\",IF(S20=$W$22,\"OK\",IF(S20=$X$22,\"OK\",\"X\"))))))),\"\")","v":""},"","","","","","See whether entered letter is represented in tiles"]
[null,null,null,null,null,null,null,null,null,null,null,null,null,null,null,"Check 2",null,{"$f":"IF(R24=\"OK\",IF(COUNTIF($R$20:$X$20,R20)<=COUNTIF($R$22:$X$22,R20), \"OK\",\"X\"),\"\")","v":""},"","","","","","","See whether entered letter count exceeds tile letter count"]
[null,null,null,null,null,null,null,null,null,null,null,null,null,null,null,"Number (New)",null,{"$f":"IF(R20<>\"\",1,\"\")","v":""},{"$f":"IF(S20<>\"\",IF(COUNTIF($R$20:R20,S20)=0,1,COUNTIF($R$20:R20,S20)+1),\"\")","v":""},{"$f":"IF(T20<>\"\",IF(COUNTIF($R$20:S20,T20)=0,1,COUNTIF($R$20:S20,T20)+1),\"\")","v":""},{"$f":"IF(U20<>\"\",IF(COUNTIF($R$20:T20,U20)=0,1,COUNTIF($R$20:T20,U20)+1),\"\")","v":""},{"$f":"IF(V20<>\"\",IF(COUNTIF($R$20:U20,V20)=0,1,COUNTIF($R$20:U20,V20)+1),\"\")","v":""},{"$f":"IF(W20<>\"\",IF(COUNTIF($R$20:V20,W20)=0,1,COUNTIF($R$20:V20,W20)+1),\"\")","v":""},{"$f":"IF(X20<>\"\",IF(COUNTIF($R$20:W20,X20)=0,1,COUNTIF($R$20:W20,X20)+1),\"\")","v":""},"Running count of letter (new)"]
[null,null,null,null,null,null,null,null,null,null,null,null,null,null,null,"Number (Orig)",null,{"$f":"IF(R22<>\"\",1,\"\")","v":""},{"$f":"IF(S22<>\"\",IF(COUNTIF($R$22:R22,S22)=0,1,COUNTIF($R$22:R22,S22)+1),\"\")","v":""},{"$f":"IF(T22<>\"\",IF(COUNTIF($R$22:S22,T22)=0,1,COUNTIF($R$22:S22,T22)+1),\"\")","v":""},{"$f":"IF(U22<>\"\",IF(COUNTIF($R$22:T22,U22)=0,1,COUNTIF($R$22:T22,U22)+1),\"\")","v":""},{"$f":"IF(V22<>\"\",IF(COUNTIF($R$22:U22,V22)=0,1,COUNTIF($R$22:U22,V22)+1),\"\")","v":""},{"$f":"IF(W22<>\"\",IF(COUNTIF($R$22:V22,W22)=0,1,COUNTIF($R$22:V22,W22)+1),\"\")","v":""},{"$f":"IF(X22<>\"\",IF(COUNTIF($R$22:W22,X22)=0,1,COUNTIF($R$22:W22,X22)+1),\"\")","v":""},"Running count of letter (orig)"]

{"sheet":"Point View","index":2,"n_rows":16,"n_cols":32,"rows_kept":16,"cut":false,"hidden":true,"merged":[]}
[null,"Current Board",null,null,null,null,null,null,null,null,null,null,null,null,null,null,null,"Point View"]
[null,null,null,null,null,null,null,null,null,null,null,null,null,null,null,null,null,{"$f":"IFERROR(IF(LEFT(B2,1)=\"!\",0,VLOOKUP(B2,'Tiles Remaining'!$A:$C,3,FALSE)),\"\")","v":""},{"$f":"IFERROR(IF(LEFT(C2,1)=\"!\",0,VLOOKUP(C2,'Tiles Remaining'!$A:$C,3,FALSE)),\"\")","v":""},{"$f":"IFERROR(IF(LEFT(D2,1)=\"!\",0,VLOOKUP(D2,'Tiles Remaining'!$A:$C,3,FALSE)),\"\")","v":""},{"$f":"IFERROR(IF(LEFT(E2,1)=\"!\",0,VLOOKUP(E2,'Tiles Remaining'!$A:$C,3,FALSE)),\"\")","v":""},{"$f":"IFERROR(IF(LEFT(F2,1)=\"!\",0,VLOOKUP(F2,'Tiles Remaining'!$A:$C,3,FALSE)),\"\")","v":""},{"$f":"IFERROR(IF(LEFT(G2,1)=\"!\",0,VLOOKUP(G2,'Tiles Remaining'!$A:$C,3,FALSE)),\"\")","v":""},{"$f":"IFERROR(IF(LEFT(H2,1)=\"!\",0,VLOOKUP(H2,'Tiles Remaining'!$A:$C,3,FALSE)),\"\")","v":""},{"$f":"IFERROR(IF(LEFT(I2,1)=\"!\",0,VLOOKUP(I2,'Tiles Remaining'!$A:$C,3,FALSE)),\"\")","v":""},{"$f":"IFERROR(IF(LEFT(J2,1)=\"!\",0,VLOOKUP(J2,'Tiles Remaining'!$A:$C,3,FALSE)),\"\")","v":""},{"$f":"IFERROR(IF(LEFT(K2,1)=\"!\",0,VLOOKUP(K2,'Tiles Remaining'!$A:$C,3,FALSE)),\"\")","v":""},{"$f":"IFERROR(IF(LEFT(L2,1)=\"!\",0,VLOOKUP(L2,'Tiles Remaining'!$A:$C,3,FALSE)),\"\")","v":""},{"$f":"IFERROR(IF(LEFT(M2,1)=\"!\",0,VLOOKUP(M2,'Tiles Remaining'!$A:$C,3,FALSE)),\"\")","v":""},{"$f":"IFERROR(IF(LEFT(N2,1)=\"!\",0,VLOOKUP(N2,'Tiles Remaining'!$A:$C,3,FALSE)),\"\")","v":""},{"$f":"IFERROR(IF(LEFT(O2,1)=\"!\",0,VLOOKUP(O2,'Tiles Remaining'!$A:$C,3,FALSE)),\"\")","v":""},{"$f":"IFERROR(IF(LEFT(P2,1)=\"!\",0,VLOOKUP(P2,'Tiles Remaining'!$A:$C,3,FALSE)),\"\")","v":""}]
[null,null,null,null,null,null,null,null,null,null,null,null,null,null,null,null,null,{"$f":"IFERROR(IF(LEFT(B3,1)=\"!\",0,VLOOKUP(B3,'Tiles Remaining'!$A:$C,3,FALSE)),\"\")","v":""},{"$f":"IFERROR(IF(LEFT(C3,1)=\"!\",0,VLOOKUP(C3,'Tiles Remaining'!$A:$C,3,FALSE)),\"\")","v":""},{"$f":"IFERROR(IF(LEFT(D3,1)=\"!\",0,VLOOKUP(D3,'Tiles Remaining'!$A:$C,3,FALSE)),\"\")","v":""},{"$f":"IFERROR(IF(LEFT(E3,1)=\"!\",0,VLOOKUP(E3,'Tiles Remaining'!$A:$C,3,FALSE)),\"\")","v":""},{"$f":"IFERROR(IF(LEFT(F3,1)=\"!\",0,VLOOKUP(F3,'Tiles Remaining'!$A:$C,3,FALSE)),\"\")","v":""},{"$f":"IFERROR(IF(LEFT(G3,1)=\"!\",0,VLOOKUP(G3,'Tiles Remaining'!$A:$C,3,FALSE)),\"\")","v":""},{"$f":"IFERROR(IF(LEFT(H3,1)=\"!\",0,VLOOKUP(H3,'Tiles Remaining'!$A:$C,3,FALSE)),\"\")","v":""},{"$f":"IFERROR(IF(LEFT(I3,1)=\"!\",0,VLOOKUP(I3,'Tiles Remaining'!$A:$C,3,FALSE)),\"\")","v":""},{"$f":"IFERROR(IF(LEFT(J3,1)=\"!\",0,VLOOKUP(J3,'Tiles Remaining'!$A:$C,3,FALSE)),\"\")","v":""},{"$f":"IFERROR(IF(LEFT(K3,1)=\"!\",0,VLOOKUP(K3,'Tiles Remaining'!$A:$C,3,FALSE)),\"\")","v":""},{"$f":"IFERROR(IF(LEFT(L3,1)=\"!\",0,VLOOKUP(L3,'Tiles Remaining'!$A:$C,3,FALSE)),\"\")","v":""},{"$f":"IFERROR(IF(LEFT(M3,1)=\"!\",0,VLOOKUP(M3,'Tiles Remaining'!$A:$C,3,FALSE)),\"\")","v":""},{"$f":"IFERROR(IF(LEFT(N3,1)=\"!\",0,VLOOKUP(N3,'Tiles Remaining'!$A:$C,3,FALSE)),\"\")","v":""},{"$f":"IFERROR(IF(LEFT(O3,1)=\"!\",0,VLOOKUP(O3,'Tiles Remaining'!$A:$C,3,FALSE)),\"\")","v":""},{"$f":"IFERROR(IF(LEFT(P3,1)=\"!\",0,VLOOKUP(P3,'Tiles Remaining'!$A:$C,3,FALSE)),\"\")","v":""}]
[null,null,null,null,null,null,null,null,null,null,null,null,null,null,null,null,null,{"$f":"IFERROR(IF(LEFT(B4,1)=\"!\",0,VLOOKUP(B4,'Tiles Remaining'!$A:$C,3,FALSE)),\"\")","v":""},{"$f":"IFERROR(IF(LEFT(C4,1)=\"!\",0,VLOOKUP(C4,'Tiles Remaining'!$A:$C,3,FALSE)),\"\")","v":""},{"$f":"IFERROR(IF(LEFT(D4,1)=\"!\",0,VLOOKUP(D4,'Tiles Remaining'!$A:$C,3,FALSE)),\"\")","v":""},{"$f":"IFERROR(IF(LEFT(E4,1)=\"!\",0,VLOOKUP(E4,'Tiles Remaining'!$A:$C,3,FALSE)),\"\")","v":""},{"$f":"IFERROR(IF(LEFT(F4,1)=\"!\",0,VLOOKUP(F4,'Tiles Remaining'!$A:$C,3,FALSE)),\"\")","v":""},{"$f":"IFERROR(IF(LEFT(G4,1)=\"!\",0,VLOOKUP(G4,'Tiles Remaining'!$A:$C,3,FALSE)),\"\")","v":""},{"$f":"IFERROR(IF(LEFT(H4,1)=\"!\",0,VLOOKUP(H4,'Tiles Remaining'!$A:$C,3,FALSE)),\"\")","v":""},{"$f":"IFERROR(IF(LEFT(I4,1)=\"!\",0,VLOOKUP(I4,'Tiles Remaining'!$A:$C,3,FALSE)),\"\")","v":""},{"$f":"IFERROR(IF(LEFT(J4,1)=\"!\",0,VLOOKUP(J4,'Tiles Remaining'!$A:$C,3,FALSE)),\"\")","v":""},{"$f":"IFERROR(IF(LEFT(K4,1)=\"!\",0,VLOOKUP(K4,'Tiles Remaining'!$A:$C,3,FALSE)),\"\")","v":""},{"$f":"IFERROR(IF(LEFT(L4,1)=\"!\",0,VLOOKUP(L4,'Tiles Remaining'!$A:$C,3,FALSE)),\"\")","v":""},{"$f":"IFERROR(IF(LEFT(M4,1)=\"!\",0,VLOOKUP(M4,'Tiles Remaining'!$A:$C,3,FALSE)),\"\")","v":""},{"$f":"IFERROR(IF(LEFT(N4,1)=\"!\",0,VLOOKUP(N4,'Tiles Remaining'!$A:$C,3,FALSE)),\"\")","v":""},{"$f":"IFERROR(IF(LEFT(O4,1)=\"!\",0,VLOOKUP(O4,'Tiles Remaining'!$A:$C,3,FALSE)),\"\")","v":""},{"$f":"IFERROR(IF(LEFT(P4,1)=\"!\",0,VLOOKUP(P4,'Tiles Remaining'!$A:$C,3,FALSE)),\"\")","v":""}]
[null,null,null,null,null,null,null,null,null,null,null,null,null,null,null,null,null,{"$f":"IFERROR(IF(LEFT(B5,1)=\"!\",0,VLOOKUP(B5,'Tiles Remaining'!$A:$C,3,FALSE)),\"\")","v":""},{"$f":"IFERROR(IF(LEFT(C5,1)=\"!\",0,VLOOKUP(C5,'Tiles Remaining'!$A:$C,3,FALSE)),\"\")","v":""},{"$f":"IFERROR(IF(LEFT(D5,1)=\"!\",0,VLOOKUP(D5,'Tiles Remaining'!$A:$C,3,FALSE)),\"\")","v":""},{"$f":"IFERROR(IF(LEFT(E5,1)=\"!\",0,VLOOKUP(E5,'Tiles Remaining'!$A:$C,3,FALSE)),\"\")","v":""},{"$f":"IFERROR(IF(LEFT(F5,1)=\"!\",0,VLOOKUP(F5,'Tiles Remaining'!$A:$C,3,FALSE)),\"\")","v":""},{"$f":"IFERROR(IF(LEFT(G5,1)=\"!\",0,VLOOKUP(G5,'Tiles Remaining'!$A:$C,3,FALSE)),\"\")","v":""},{"$f":"IFERROR(IF(LEFT(H5,1)=\"!\",0,VLOOKUP(H5,'Tiles Remaining'!$A:$C,3,FALSE)),\"\")","v":""},{"$f":"IFERROR(IF(LEFT(I5,1)=\"!\",0,VLOOKUP(I5,'Tiles Remaining'!$A:$C,3,FALSE)),\"\")","v":""},{"$f":"IFERROR(IF(LEFT(J5,1)=\"!\",0,VLOOKUP(J5,'Tiles Remaining'!$A:$C,3,FALSE)),\"\")","v":""},{"$f":"IFERROR(IF(LEFT(K5,1)=\"!\",0,VLOOKUP(K5,'Tiles Remaining'!$A:$C,3,FALSE)),\"\")","v":""},{"$f":"IFERROR(IF(LEFT(L5,1)=\"!\",0,VLOOKUP(L5,'Tiles Remaining'!$A:$C,3,FALSE)),\"\")","v":""},{"$f":"IFERROR(IF(LEFT(M5,1)=\"!\",0,VLOOKUP(M5,'Tiles Remaining'!$A:$C,3,FALSE)),\"\")","v":""},{"$f":"IFERROR(IF(LEFT(N5,1)=\"!\",0,VLOOKUP(N5,'Tiles Remaining'!$A:$C,3,FALSE)),\"\")","v":""},{"$f":"IFERROR(IF(LEFT(O5,1)=\"!\",0,VLOOKUP(O5,'Tiles Remaining'!$A:$C,3,FALSE)),\"\")","v":""},{"$f":"IFERROR(IF(LEFT(P5,1)=\"!\",0,VLOOKUP(P5,'Tiles Remaining'!$A:$C,3,FALSE)),\"\")","v":""}]
[null,null,null,null,null,null,null,null,null,null,null,null,null,null,null,null,null,{"$f":"IFERROR(IF(LEFT(B6,1)=\"!\",0,VLOOKUP(B6,'Tiles Remaining'!$A:$C,3,FALSE)),\"\")","v":""},{"$f":"IFERROR(IF(LEFT(C6,1)=\"!\",0,VLOOKUP(C6,'Tiles Remaining'!$A:$C,3,FALSE)),\"\")","v":""},{"$f":"IFERROR(IF(LEFT(D6,1)=\"!\",0,VLOOKUP(D6,'Tiles Remaining'!$A:$C,3,FALSE)),\"\")","v":""},{"$f":"IFERROR(IF(LEFT(E6,1)=\"!\",0,VLOOKUP(E6,'Tiles Remaining'!$A:$C,3,FALSE)),\"\")","v":""},{"$f":"IFERROR(IF(LEFT(F6,1)=\"!\",0,VLOOKUP(F6,'Tiles Remaining'!$A:$C,3,FALSE)),\"\")","v":""},{"$f":"IFERROR(IF(LEFT(G6,1)=\"!\",0,VLOOKUP(G6,'Tiles Remaining'!$A:$C,3,FALSE)),\"\")","v":""},{"$f":"IFERROR(IF(LEFT(H6,1)=\"!\",0,VLOOKUP(H6,'Tiles Remaining'!$A:$C,3,FALSE)),\"\")","v":""},{"$f":"IFERROR(IF(LEFT(I6,1)=\"!\",0,VLOOKUP(I6,'Tiles Remaining'!$A:$C,3,FALSE)),\"\")","v":""},{"$f":"IFERROR(IF(LEFT(J6,1)=\"!\",0,VLOOKUP(J6,'Tiles Remaining'!$A:$C,3,FALSE)),\"\")","v":""},{"$f":"IFERROR(IF(LEFT(K6,1)=\"!\",0,VLOOKUP(K6,'Tiles Remaining'!$A:$C,3,FALSE)),\"\")","v":""},{"$f":"IFERROR(IF(LEFT(L6,1)=\"!\",0,VLOOKUP(L6,'Tiles Remaining'!$A:$C,3,FALSE)),\"\")","v":""},{"$f":"IFERROR(IF(LEFT(M6,1)=\"!\",0,VLOOKUP(M6,'Tiles Remaining'!$A:$C,3,FALSE)),\"\")","v":""},{"$f":"IFERROR(IF(LEFT(N6,1)=\"!\",0,VLOOKUP(N6,'Tiles Remaining'!$A:$C,3,FALSE)),\"\")","v":""},{"$f":"IFERROR(IF(LEFT(O6,1)=\"!\",0,VLOOKUP(O6,'Tiles Remaining'!$A:$C,3,FALSE)),\"\")","v":""},{"$f":"IFERROR(IF(LEFT(P6,1)=\"!\",0,VLOOKUP(P6,'Tiles Remaining'!$A:$C,3,FALSE)),\"\")","v":""}]
[null,null,null,null,null,null,null,null,null,null,null,null,null,null,null,null,null,{"$f":"IFERROR(IF(LEFT(B7,1)=\"!\",0,VLOOKUP(B7,'Tiles Remaining'!$A:$C,3,FALSE)),\"\")","v":""},{"$f":"IFERROR(IF(LEFT(C7,1)=\"!\",0,VLOOKUP(C7,'Tiles Remaining'!$A:$C,3,FALSE)),\"\")","v":""},{"$f":"IFERROR(IF(LEFT(D7,1)=\"!\",0,VLOOKUP(D7,'Tiles Remaining'!$A:$C,3,FALSE)),\"\")","v":""},{"$f":"IFERROR(IF(LEFT(E7,1)=\"!\",0,VLOOKUP(E7,'Tiles Remaining'!$A:$C,3,FALSE)),\"\")","v":""},{"$f":"IFERROR(IF(LEFT(F7,1)=\"!\",0,VLOOKUP(F7,'Tiles Remaining'!$A:$C,3,FALSE)),\"\")","v":""},{"$f":"IFERROR(IF(LEFT(G7,1)=\"!\",0,VLOOKUP(G7,'Tiles Remaining'!$A:$C,3,FALSE)),\"\")","v":""},{"$f":"IFERROR(IF(LEFT(H7,1)=\"!\",0,VLOOKUP(H7,'Tiles Remaining'!$A:$C,3,FALSE)),\"\")","v":""},{"$f":"IFERROR(IF(LEFT(I7,1)=\"!\",0,VLOOKUP(I7,'Tiles Remaining'!$A:$C,3,FALSE)),\"\")","v":""},{"$f":"IFERROR(IF(LEFT(J7,1)=\"!\",0,VLOOKUP(J7,'Tiles Remaining'!$A:$C,3,FALSE)),\"\")","v":""},{"$f":"IFERROR(IF(LEFT(K7,1)=\"!\",0,VLOOKUP(K7,'Tiles Remaining'!$A:$C,3,FALSE)),\"\")","v":""},{"$f":"IFERROR(IF(LEFT(L7,1)=\"!\",0,VLOOKUP(L7,'Tiles Remaining'!$A:$C,3,FALSE)),\"\")","v":""},{"$f":"IFERROR(IF(LEFT(M7,1)=\"!\",0,VLOOKUP(M7,'Tiles Remaining'!$A:$C,3,FALSE)),\"\")","v":""},{"$f":"IFERROR(IF(LEFT(N7,1)=\"!\",0,VLOOKUP(N7,'Tiles Remaining'!$A:$C,3,FALSE)),\"\")","v":""},{"$f":"IFERROR(IF(LEFT(O7,1)=\"!\",0,VLOOKUP(O7,'Tiles Remaining'!$A:$C,3,FALSE)),\"\")","v":""},{"$f":"IFERROR(IF(LEFT(P7,1)=\"!\",0,VLOOKUP(P7,'Tiles Remaining'!$A:$C,3,FALSE)),\"\")","v":""}]
[null,null,null,null,null,null,null,null,null,null,null,null,null,null,null,null,null,{"$f":"IFERROR(IF(LEFT(B8,1)=\"!\",0,VLOOKUP(B8,'Tiles Remaining'!$A:$C,3,FALSE)),\"\")","v":""},{"$f":"IFERROR(IF(LEFT(C8,1)=\"!\",0,VLOOKUP(C8,'Tiles Remaining'!$A:$C,3,FALSE)),\"\")","v":""},{"$f":"IFERROR(IF(LEFT(D8,1)=\"!\",0,VLOOKUP(D8,'Tiles Remaining'!$A:$C,3,FALSE)),\"\")","v":""},{"$f":"IFERROR(IF(LEFT(E8,1)=\"!\",0,VLOOKUP(E8,'Tiles Remaining'!$A:$C,3,FALSE)),\"\")","v":""},{"$f":"IFERROR(IF(LEFT(F8,1)=\"!\",0,VLOOKUP(F8,'Tiles Remaining'!$A:$C,3,FALSE)),\"\")","v":""},{"$f":"IFERROR(IF(LEFT(G8,1)=\"!\",0,VLOOKUP(G8,'Tiles Remaining'!$A:$C,3,FALSE)),\"\")","v":""},{"$f":"IFERROR(IF(LEFT(H8,1)=\"!\",0,VLOOKUP(H8,'Tiles Remaining'!$A:$C,3,FALSE)),\"\")","v":""},{"$f":"IFERROR(IF(LEFT(I8,1)=\"!\",0,VLOOKUP(I8,'Tiles Remaining'!$A:$C,3,FALSE)),\"\")","v":""},{"$f":"IFERROR(IF(LEFT(J8,1)=\"!\",0,VLOOKUP(J8,'Tiles Remaining'!$A:$C,3,FALSE)),\"\")","v":""},{"$f":"IFERROR(IF(LEFT(K8,1)=\"!\",0,VLOOKUP(K8,'Tiles Remaining'!$A:$C,3,FALSE)),\"\")","v":""},{"$f":"IFERROR(IF(LEFT(L8,1)=\"!\",0,VLOOKUP(L8,'Tiles Remaining'!$A:$C,3,FALSE)),\"\")","v":""},{"$f":"IFERROR(IF(LEFT(M8,1)=\"!\",0,VLOOKUP(M8,'Tiles Remaining'!$A:$C,3,FALSE)),\"\")","v":""},{"$f":"IFERROR(IF(LEFT(N8,1)=\"!\",0,VLOOKUP(N8,'Tiles Remaining'!$A:$C,3,FALSE)),\"\")","v":""},{"$f":"IFERROR(IF(LEFT(O8,1)=\"!\",0,VLOOKUP(O8,'Tiles Remaining'!$A:$C,3,FALSE)),\"\")","v":""},{"$f":"IFERROR(IF(LEFT(P8,1)=\"!\",0,VLOOKUP(P8,'Tiles Remaining'!$A:$C,3,FALSE)),\"\")","v":""}]
[null,null,null,null,null,null,null,null,null,null,null,null,null,null,null,null,null,{"$f":"IFERROR(IF(LEFT(B9,1)=\"!\",0,VLOOKUP(B9,'Tiles Remaining'!$A:$C,3,FALSE)),\"\")","v":""},{"$f":"IFERROR(IF(LEFT(C9,1)=\"!\",0,VLOOKUP(C9,'Tiles Remaining'!$A:$C,3,FALSE)),\"\")","v":""},{"$f":"IFERROR(IF(LEFT(D9,1)=\"!\",0,VLOOKUP(D9,'Tiles Remaining'!$A:$C,3,FALSE)),\"\")","v":""},{"$f":"IFERROR(IF(LEFT(E9,1)=\"!\",0,VLOOKUP(E9,'Tiles Remaining'!$A:$C,3,FALSE)),\"\")","v":""},{"$f":"IFERROR(IF(LEFT(F9,1)=\"!\",0,VLOOKUP(F9,'Tiles Remaining'!$A:$C,3,FALSE)),\"\")","v":""},{"$f":"IFERROR(IF(LEFT(G9,1)=\"!\",0,VLOOKUP(G9,'Tiles Remaining'!$A:$C,3,FALSE)),\"\")","v":""},{"$f":"IFERROR(IF(LEFT(H9,1)=\"!\",0,VLOOKUP(H9,'Tiles Remaining'!$A:$C,3,FALSE)),\"\")","v":""},{"$f":"IFERROR(IF(LEFT(I9,1)=\"!\",0,VLOOKUP(I9,'Tiles Remaining'!$A:$C,3,FALSE)),\"\")","v":""},{"$f":"IFERROR(IF(LEFT(J9,1)=\"!\",0,VLOOKUP(J9,'Tiles Remaining'!$A:$C,3,FALSE)),\"\")","v":""},{"$f":"IFERROR(IF(LEFT(K9,1)=\"!\",0,VLOOKUP(K9,'Tiles Remaining'!$A:$C,3,FALSE)),\"\")","v":""},{"$f":"IFERROR(IF(LEFT(L9,1)=\"!\",0,VLOOKUP(L9,'Tiles Remaining'!$A:$C,3,FALSE)),\"\")","v":""},{"$f":"IFERROR(IF(LEFT(M9,1)=\"!\",0,VLOOKUP(M9,'Tiles Remaining'!$A:$C,3,FALSE)),\"\")","v":""},{"$f":"IFERROR(IF(LEFT(N9,1)=\"!\",0,VLOOKUP(N9,'Tiles Remaining'!$A:$C,3,FALSE)),\"\")","v":""},{"$f":"IFERROR(IF(LEFT(O9,1)=\"!\",0,VLOOKUP(O9,'Tiles Remaining'!$A:$C,3,FALSE)),\"\")","v":""},{"$f":"IFERROR(IF(LEFT(P9,1)=\"!\",0,VLOOKUP(P9,'Tiles Remaining'!$A:$C,3,FALSE)),\"\")","v":""}]
[null,null,null,null,null,null,null,null,null,null,null,null,null,null,null,null,null,{"$f":"IFERROR(IF(LEFT(B10,1)=\"!\",0,VLOOKUP(B10,'Tiles Remaining'!$A:$C,3,FALSE)),\"\")","v":""},{"$f":"IFERROR(IF(LEFT(C10,1)=\"!\",0,VLOOKUP(C10,'Tiles Remaining'!$A:$C,3,FALSE)),\"\")","v":""},{"$f":"IFERROR(IF(LEFT(D10,1)=\"!\",0,VLOOKUP(D10,'Tiles Remaining'!$A:$C,3,FALSE)),\"\")","v":""},{"$f":"IFERROR(IF(LEFT(E10,1)=\"!\",0,VLOOKUP(E10,'Tiles Remaining'!$A:$C,3,FALSE)),\"\")","v":""},{"$f":"IFERROR(IF(LEFT(F10,1)=\"!\",0,VLOOKUP(F10,'Tiles Remaining'!$A:$C,3,FALSE)),\"\")","v":""},{"$f":"IFERROR(IF(LEFT(G10,1)=\"!\",0,VLOOKUP(G10,'Tiles Remaining'!$A:$C,3,FALSE)),\"\")","v":""},{"$f":"IFERROR(IF(LEFT(H10,1)=\"!\",0,VLOOKUP(H10,'Tiles Remaining'!$A:$C,3,FALSE)),\"\")","v":""},{"$f":"IFERROR(IF(LEFT(I10,1)=\"!\",0,VLOOKUP(I10,'Tiles Remaining'!$A:$C,3,FALSE)),\"\")","v":""},{"$f":"IFERROR(IF(LEFT(J10,1)=\"!\",0,VLOOKUP(J10,'Tiles Remaining'!$A:$C,3,FALSE)),\"\")","v":""},{"$f":"IFERROR(IF(LEFT(K10,1)=\"!\",0,VLOOKUP(K10,'Tiles Remaining'!$A:$C,3,FALSE)),\"\")","v":""},{"$f":"IFERROR(IF(LEFT(L10,1)=\"!\",0,VLOOKUP(L10,'Tiles Remaining'!$A:$C,3,FALSE)),\"\")","v":""},{"$f":"IFERROR(IF(LEFT(M10,1)=\"!\",0,VLOOKUP(M10,'Tiles Remaining'!$A:$C,3,FALSE)),\"\")","v":""},{"$f":"IFERROR(IF(LEFT(N10,1)=\"!\",0,VLOOKUP(N10,'Tiles Remaining'!$A:$C,3,FALSE)),\"\")","v":""},{"$f":"IFERROR(IF(LEFT(O10,1)=\"!\",0,VLOOKUP(O10,'Tiles Remaining'!$A:$C,3,FALSE)),\"\")","v":""},{"$f":"IFERROR(IF(LEFT(P10,1)=\"!\",0,VLOOKUP(P10,'Tiles Remaining'!$A:$C,3,FALSE)),\"\")","v":""}]
[null,null,null,null,null,null,null,null,null,null,null,null,null,null,null,null,null,{"$f":"IFERROR(IF(LEFT(B11,1)=\"!\",0,VLOOKUP(B11,'Tiles Remaining'!$A:$C,3,FALSE)),\"\")","v":""},{"$f":"IFERROR(IF(LEFT(C11,1)=\"!\",0,VLOOKUP(C11,'Tiles Remaining'!$A:$C,3,FALSE)),\"\")","v":""},{"$f":"IFERROR(IF(LEFT(D11,1)=\"!\",0,VLOOKUP(D11,'Tiles Remaining'!$A:$C,3,FALSE)),\"\")","v":""},{"$f":"IFERROR(IF(LEFT(E11,1)=\"!\",0,VLOOKUP(E11,'Tiles Remaining'!$A:$C,3,FALSE)),\"\")","v":""},{"$f":"IFERROR(IF(LEFT(F11,1)=\"!\",0,VLOOKUP(F11,'Tiles Remaining'!$A:$C,3,FALSE)),\"\")","v":""},{"$f":"IFERROR(IF(LEFT(G11,1)=\"!\",0,VLOOKUP(G11,'Tiles Remaining'!$A:$C,3,FALSE)),\"\")","v":""},{"$f":"IFERROR(IF(LEFT(H11,1)=\"!\",0,VLOOKUP(H11,'Tiles Remaining'!$A:$C,3,FALSE)),\"\")","v":""},{"$f":"IFERROR(IF(LEFT(I11,1)=\"!\",0,VLOOKUP(I11,'Tiles Remaining'!$A:$C,3,FALSE)),\"\")","v":""},{"$f":"IFERROR(IF(LEFT(J11,1)=\"!\",0,VLOOKUP(J11,'Tiles Remaining'!$A:$C,3,FALSE)),\"\")","v":""},{"$f":"IFERROR(IF(LEFT(K11,1)=\"!\",0,VLOOKUP(K11,'Tiles Remaining'!$A:$C,3,FALSE)),\"\")","v":""},{"$f":"IFERROR(IF(LEFT(L11,1)=\"!\",0,VLOOKUP(L11,'Tiles Remaining'!$A:$C,3,FALSE)),\"\")","v":""},{"$f":"IFERROR(IF(LEFT(M11,1)=\"!\",0,VLOOKUP(M11,'Tiles Remaining'!$A:$C,3,FALSE)),\"\")","v":""},{"$f":"IFERROR(IF(LEFT(N11,1)=\"!\",0,VLOOKUP(N11,'Tiles Remaining'!$A:$C,3,FALSE)),\"\")","v":""},{"$f":"IFERROR(IF(LEFT(O11,1)=\"!\",0,VLOOKUP(O11,'Tiles Remaining'!$A:$C,3,FALSE)),\"\")","v":""},{"$f":"IFERROR(IF(LEFT(P11,1)=\"!\",0,VLOOKUP(P11,'Tiles Remaining'!$A:$C,3,FALSE)),\"\")","v":""}]
[null,null,null,null,null,null,null,null,null,null,null,null,null,null,null,null,null,{"$f":"IFERROR(IF(LEFT(B12,1)=\"!\",0,VLOOKUP(B12,'Tiles Remaining'!$A:$C,3,FALSE)),\"\")","v":""},{"$f":"IFERROR(IF(LEFT(C12,1)=\"!\",0,VLOOKUP(C12,'Tiles Remaining'!$A:$C,3,FALSE)),\"\")","v":""},{"$f":"IFERROR(IF(LEFT(D12,1)=\"!\",0,VLOOKUP(D12,'Tiles Remaining'!$A:$C,3,FALSE)),\"\")","v":""},{"$f":"IFERROR(IF(LEFT(E12,1)=\"!\",0,VLOOKUP(E12,'Tiles Remaining'!$A:$C,3,FALSE)),\"\")","v":""},{"$f":"IFERROR(IF(LEFT(F12,1)=\"!\",0,VLOOKUP(F12,'Tiles Remaining'!$A:$C,3,FALSE)),\"\")","v":""},{"$f":"IFERROR(IF(LEFT(G12,1)=\"!\",0,VLOOKUP(G12,'Tiles Remaining'!$A:$C,3,FALSE)),\"\")","v":""},{"$f":"IFERROR(IF(LEFT(H12,1)=\"!\",0,VLOOKUP(H12,'Tiles Remaining'!$A:$C,3,FALSE)),\"\")","v":""},{"$f":"IFERROR(IF(LEFT(I12,1)=\"!\",0,VLOOKUP(I12,'Tiles Remaining'!$A:$C,3,FALSE)),\"\")","v":""},{"$f":"IFERROR(IF(LEFT(J12,1)=\"!\",0,VLOOKUP(J12,'Tiles Remaining'!$A:$C,3,FALSE)),\"\")","v":""},{"$f":"IFERROR(IF(LEFT(K12,1)=\"!\",0,VLOOKUP(K12,'Tiles Remaining'!$A:$C,3,FALSE)),\"\")","v":""},{"$f":"IFERROR(IF(LEFT(L12,1)=\"!\",0,VLOOKUP(L12,'Tiles Remaining'!$A:$C,3,FALSE)),\"\")","v":""},{"$f":"IFERROR(IF(LEFT(M12,1)=\"!\",0,VLOOKUP(M12,'Tiles Remaining'!$A:$C,3,FALSE)),\"\")","v":""},{"$f":"IFERROR(IF(LEFT(N12,1)=\"!\",0,VLOOKUP(N12,'Tiles Remaining'!$A:$C,3,FALSE)),\"\")","v":""},{"$f":"IFERROR(IF(LEFT(O12,1)=\"!\",0,VLOOKUP(O12,'Tiles Remaining'!$A:$C,3,FALSE)),\"\")","v":""},{"$f":"IFERROR(IF(LEFT(P12,1)=\"!\",0,VLOOKUP(P12,'Tiles Remaining'!$A:$C,3,FALSE)),\"\")","v":""}]
[null,null,null,null,null,null,null,null,null,null,null,null,null,null,null,null,null,{"$f":"IFERROR(IF(LEFT(B13,1)=\"!\",0,VLOOKUP(B13,'Tiles Remaining'!$A:$C,3,FALSE)),\"\")","v":""},{"$f":"IFERROR(IF(LEFT(C13,1)=\"!\",0,VLOOKUP(C13,'Tiles Remaining'!$A:$C,3,FALSE)),\"\")","v":""},{"$f":"IFERROR(IF(LEFT(D13,1)=\"!\",0,VLOOKUP(D13,'Tiles Remaining'!$A:$C,3,FALSE)),\"\")","v":""},{"$f":"IFERROR(IF(LEFT(E13,1)=\"!\",0,VLOOKUP(E13,'Tiles Remaining'!$A:$C,3,FALSE)),\"\")","v":""},{"$f":"IFERROR(IF(LEFT(F13,1)=\"!\",0,VLOOKUP(F13,'Tiles Remaining'!$A:$C,3,FALSE)),\"\")","v":""},{"$f":"IFERROR(IF(LEFT(G13,1)=\"!\",0,VLOOKUP(G13,'Tiles Remaining'!$A:$C,3,FALSE)),\"\")","v":""},{"$f":"IFERROR(IF(LEFT(H13,1)=\"!\",0,VLOOKUP(H13,'Tiles Remaining'!$A:$C,3,FALSE)),\"\")","v":""},{"$f":"IFERROR(IF(LEFT(I13,1)=\"!\",0,VLOOKUP(I13,'Tiles Remaining'!$A:$C,3,FALSE)),\"\")","v":""},{"$f":"IFERROR(IF(LEFT(J13,1)=\"!\",0,VLOOKUP(J13,'Tiles Remaining'!$A:$C,3,FALSE)),\"\")","v":""},{"$f":"IFERROR(IF(LEFT(K13,1)=\"!\",0,VLOOKUP(K13,'Tiles Remaining'!$A:$C,3,FALSE)),\"\")","v":""},{"$f":"IFERROR(IF(LEFT(L13,1)=\"!\",0,VLOOKUP(L13,'Tiles Remaining'!$A:$C,3,FALSE)),\"\")","v":""},{"$f":"IFERROR(IF(LEFT(M13,1)=\"!\",0,VLOOKUP(M13,'Tiles Remaining'!$A:$C,3,FALSE)),\"\")","v":""},{"$f":"IFERROR(IF(LEFT(N13,1)=\"!\",0,VLOOKUP(N13,'Tiles Remaining'!$A:$C,3,FALSE)),\"\")","v":""},{"$f":"IFERROR(IF(LEFT(O13,1)=\"!\",0,VLOOKUP(O13,'Tiles Remaining'!$A:$C,3,FALSE)),\"\")","v":""},{"$f":"IFERROR(IF(LEFT(P13,1)=\"!\",0,VLOOKUP(P13,'Tiles Remaining'!$A:$C,3,FALSE)),\"\")","v":""}]
[null,null,null,null,null,null,null,null,null,null,null,null,null,null,null,null,null,{"$f":"IFERROR(IF(LEFT(B14,1)=\"!\",0,VLOOKUP(B14,'Tiles Remaining'!$A:$C,3,FALSE)),\"\")","v":""},{"$f":"IFERROR(IF(LEFT(C14,1)=\"!\",0,VLOOKUP(C14,'Tiles Remaining'!$A:$C,3,FALSE)),\"\")","v":""},{"$f":"IFERROR(IF(LEFT(D14,1)=\"!\",0,VLOOKUP(D14,'Tiles Remaining'!$A:$C,3,FALSE)),\"\")","v":""},{"$f":"IFERROR(IF(LEFT(E14,1)=\"!\",0,VLOOKUP(E14,'Tiles Remaining'!$A:$C,3,FALSE)),\"\")","v":""},{"$f":"IFERROR(IF(LEFT(F14,1)=\"!\",0,VLOOKUP(F14,'Tiles Remaining'!$A:$C,3,FALSE)),\"\")","v":""},{"$f":"IFERROR(IF(LEFT(G14,1)=\"!\",0,VLOOKUP(G14,'Tiles Remaining'!$A:$C,3,FALSE)),\"\")","v":""},{"$f":"IFERROR(IF(LEFT(H14,1)=\"!\",0,VLOOKUP(H14,'Tiles Remaining'!$A:$C,3,FALSE)),\"\")","v":""},{"$f":"IFERROR(IF(LEFT(I14,1)=\"!\",0,VLOOKUP(I14,'Tiles Remaining'!$A:$C,3,FALSE)),\"\")","v":""},{"$f":"IFERROR(IF(LEFT(J14,1)=\"!\",0,VLOOKUP(J14,'Tiles Remaining'!$A:$C,3,FALSE)),\"\")","v":""},{"$f":"IFERROR(IF(LEFT(K14,1)=\"!\",0,VLOOKUP(K14,'Tiles Remaining'!$A:$C,3,FALSE)),\"\")","v":""},{"$f":"IFERROR(IF(LEFT(L14,1)=\"!\",0,VLOOKUP(L14,'Tiles Remaining'!$A:$C,3,FALSE)),\"\")","v":""},{"$f":"IFERROR(IF(LEFT(M14,1)=\"!\",0,VLOOKUP(M14,'Tiles Remaining'!$A:$C,3,FALSE)),\"\")","v":""},{"$f":"IFERROR(IF(LEFT(N14,1)=\"!\",0,VLOOKUP(N14,'Tiles Remaining'!$A:$C,3,FALSE)),\"\")","v":""},{"$f":"IFERROR(IF(LEFT(O14,1)=\"!\",0,VLOOKUP(O14,'Tiles Remaining'!$A:$C,3,FALSE)),\"\")","v":""},{"$f":"IFERROR(IF(LEFT(P14,1)=\"!\",0,VLOOKUP(P14,'Tiles Remaining'!$A:$C,3,FALSE)),\"\")","v":""}]
[null,null,null,null,null,null,null,null,null,null,null,null,null,null,null,null,null,{"$f":"IFERROR(IF(LEFT(B15,1)=\"!\",0,VLOOKUP(B15,'Tiles Remaining'!$A:$C,3,FALSE)),\"\")","v":""},{"$f":"IFERROR(IF(LEFT(C15,1)=\"!\",0,VLOOKUP(C15,'Tiles Remaining'!$A:$C,3,FALSE)),\"\")","v":""},{"$f":"IFERROR(IF(LEFT(D15,1)=\"!\",0,VLOOKUP(D15,'Tiles Remaining'!$A:$C,3,FALSE)),\"\")","v":""},{"$f":"IFERROR(IF(LEFT(E15,1)=\"!\",0,VLOOKUP(E15,'Tiles Remaining'!$A:$C,3,FALSE)),\"\")","v":""},{"$f":"IFERROR(IF(LEFT(F15,1)=\"!\",0,VLOOKUP(F15,'Tiles Remaining'!$A:$C,3,FALSE)),\"\")","v":""},{"$f":"IFERROR(IF(LEFT(G15,1)=\"!\",0,VLOOKUP(G15,'Tiles Remaining'!$A:$C,3,FALSE)),\"\")","v":""},{"$f":"IFERROR(IF(LEFT(H15,1)=\"!\",0,VLOOKUP(H15,'Tiles Remaining'!$A:$C,3,FALSE)),\"\")","v":""},{"$f":"IFERROR(IF(LEFT(I15,1)=\"!\",0,VLOOKUP(I15,'Tiles Remaining'!$A:$C,3,FALSE)),\"\")","v":""},{"$f":"IFERROR(IF(LEFT(J15,1)=\"!\",0,VLOOKUP(J15,'Tiles Remaining'!$A:$C,3,FALSE)),\"\")","v":""},{"$f":"IFERROR(IF(LEFT(K15,1)=\"!\",0,VLOOKUP(K15,'Tiles Remaining'!$A:$C,3,FALSE)),\"\")","v":""},{"$f":"IFERROR(IF(LEFT(L15,1)=\"!\",0,VLOOKUP(L15,'Tiles Remaining'!$A:$C,3,FALSE)),\"\")","v":""},{"$f":"IFERROR(IF(LEFT(M15,1)=\"!\",0,VLOOKUP(M15,'Tiles Remaining'!$A:$C,3,FALSE)),\"\")","v":""},{"$f":"IFERROR(IF(LEFT(N15,1)=\"!\",0,VLOOKUP(N15,'Tiles Remaining'!$A:$C,3,FALSE)),\"\")","v":""},{"$f":"IFERROR(IF(LEFT(O15,1)=\"!\",0,VLOOKUP(O15,'Tiles Remaining'!$A:$C,3,FALSE)),\"\")","v":""},{"$f":"IFERROR(IF(LEFT(P15,1)=\"!\",0,VLOOKUP(P15,'Tiles Remaining'!$A:$C,3,FALSE)),\"\")","v":""}]
[null,null,null,null,null,null,null,null,null,null,null,null,null,null,null,null,null,{"$f":"IFERROR(IF(LEFT(B16,1)=\"!\",0,VLOOKUP(B16,'Tiles Remaining'!$A:$C,3,FALSE)),\"\")","v":""},{"$f":"IFERROR(IF(LEFT(C16,1)=\"!\",0,VLOOKUP(C16,'Tiles Remaining'!$A:$C,3,FALSE)),\"\")","v":""},{"$f":"IFERROR(IF(LEFT(D16,1)=\"!\",0,VLOOKUP(D16,'Tiles Remaining'!$A:$C,3,FALSE)),\"\")","v":""},{"$f":"IFERROR(IF(LEFT(E16,1)=\"!\",0,VLOOKUP(E16,'Tiles Remaining'!$A:$C,3,FALSE)),\"\")","v":""},{"$f":"IFERROR(IF(LEFT(F16,1)=\"!\",0,VLOOKUP(F16,'Tiles Remaining'!$A:$C,3,FALSE)),\"\")","v":""},{"$f":"IFERROR(IF(LEFT(G16,1)=\"!\",0,VLOOKUP(G16,'Tiles Remaining'!$A:$C,3,FALSE)),\"\")","v":""},{"$f":"IFERROR(IF(LEFT(H16,1)=\"!\",0,VLOOKUP(H16,'Tiles Remaining'!$A:$C,3,FALSE)),\"\")","v":""},{"$f":"IFERROR(IF(LEFT(I16,1)=\"!\",0,VLOOKUP(I16,'Tiles Remaining'!$A:$C,3,FALSE)),\"\")","v":""},{"$f":"IFERROR(IF(LEFT(J16,1)=\"!\",0,VLOOKUP(J16,'Tiles Remaining'!$A:$C,3,FALSE)),\"\")","v":""},{"$f":"IFERROR(IF(LEFT(K16,1)=\"!\",0,VLOOKUP(K16,'Tiles Remaining'!$A:$C,3,FALSE)),\"\")","v":""},{"$f":"IFERROR(IF(LEFT(L16,1)=\"!\",0,VLOOKUP(L16,'Tiles Remaining'!$A:$C,3,FALSE)),\"\")","v":""},{"$f":"IFERROR(IF(LEFT(M16,1)=\"!\",0,VLOOKUP(M16,'Tiles Remaining'!$A:$C,3,FALSE)),\"\")","v":""},{"$f":"IFERROR(IF(LEFT(N16,1)=\"!\",0,VLOOKUP(N16,'Tiles Remaining'!$A:$C,3,FALSE)),\"\")","v":""},{"$f":"IFERROR(IF(LEFT(O16,1)=\"!\",0,VLOOKUP(O16,'Tiles Remaining'!$A:$C,3,FALSE)),\"\")","v":""},{"$f":"IFERROR(IF(LEFT(P16,1)=\"!\",0,VLOOKUP(P16,'Tiles Remaining'!$A:$C,3,FALSE)),\"\")","v":""}]

{"sheet":"Tiles Remaining","index":3,"n_rows":29,"n_cols":5,"rows_kept":29,"cut":false,"hidden":true,"merged":[]}
["SCRABBLE TILES"]
["Letter","Tiles","Points","Used Count","Remaining"]
["!",2,0,{"$f":"SUM(COUNTIF('Current Board'!$B$2:$P$16,\"!*\"),COUNTIF('Current Board'!$R$6:$X$6,\"!*\"),COUNTIF('Current Board'!$R$11:$X$11,\"!*\"))","v":0},{"$f":"B3-D3","v":2}]
["A",9,1,{"$f":"SUM(COUNTIF('Current Board'!$B$2:$P$16,A4),COUNTIF('Current Board'!$R$6:$X$6,A4),COUNTIF('Current Board'!$R$11:$X$11,A4))","v":0},{"$f":"B4-D4","v":9}]
["B",2,3,{"$f":"SUM(COUNTIF('Current Board'!$B$2:$P$16,A5),COUNTIF('Current Board'!$R$6:$X$6,A5),COUNTIF('Current Board'!$R$11:$X$11,A5))","v":0},2]
["C",2,3,{"$f":"SUM(COUNTIF('Current Board'!$B$2:$P$16,A6),COUNTIF('Current Board'!$R$6:$X$6,A6),COUNTIF('Current Board'!$R$11:$X$11,A6))","v":0},2]
["D",4,2,{"$f":"SUM(COUNTIF('Current Board'!$B$2:$P$16,A7),COUNTIF('Current Board'!$R$6:$X$6,A7),COUNTIF('Current Board'!$R$11:$X$11,A7))","v":0},4]
["E",12,1,{"$f":"SUM(COUNTIF('Current Board'!$B$2:$P$16,A8),COUNTIF('Current Board'!$R$6:$X$6,A8),COUNTIF('Current Board'!$R$11:$X$11,A8))","v":0},12]
["F",2,4,{"$f":"SUM(COUNTIF('Current Board'!$B$2:$P$16,A9),COUNTIF('Current Board'!$R$6:$X$6,A9),COUNTIF('Current Board'!$R$11:$X$11,A9))","v":0},2]
["G",3,2,{"$f":"SUM(COUNTIF('Current Board'!$B$2:$P$16,A10),COUNTIF('Current Board'!$R$6:$X$6,A10),COUNTIF('Current Board'!$R$11:$X$11,A10))","v":0},3]
["H",2,4,{"$f":"SUM(COUNTIF('Current Board'!$B$2:$P$16,A11),COUNTIF('Current Board'!$R$6:$X$6,A11),COUNTIF('Current Board'!$R$11:$X$11,A11))","v":0},2]
["I",9,1,{"$f":"SUM(COUNTIF('Current Board'!$B$2:$P$16,A12),COUNTIF('Current Board'!$R$6:$X$6,A12),COUNTIF('Current Board'!$R$11:$X$11,A12))","v":0},9]
["J",1,8,{"$f":"SUM(COUNTIF('Current Board'!$B$2:$P$16,A13),COUNTIF('Current Board'!$R$6:$X$6,A13),COUNTIF('Current Board'!$R$11:$X$11,A13))","v":0},1]
["K",1,5,{"$f":"SUM(COUNTIF('Current Board'!$B$2:$P$16,A14),COUNTIF('Current Board'!$R$6:$X$6,A14),COUNTIF('Current Board'!$R$11:$X$11,A14))","v":0},1]
["L",4,1,{"$f":"SUM(COUNTIF('Current Board'!$B$2:$P$16,A15),COUNTIF('Current Board'!$R$6:$X$6,A15),COUNTIF('Current Board'!$R$11:$X$11,A15))","v":0},4]
["M",2,3,{"$f":"SUM(COUNTIF('Current Board'!$B$2:$P$16,A16),COUNTIF('Current Board'!$R$6:$X$6,A16),COUNTIF('Current Board'!$R$11:$X$11,A16))","v":0},2]
["N",6,1,{"$f":"SUM(COUNTIF('Current Board'!$B$2:$P$16,A17),COUNTIF('Current Board'!$R$6:$X$6,A17),COUNTIF('Current Board'!$R$11:$X$11,A17))","v":0},6]
["O",8,1,{"$f":"SUM(COUNTIF('Current Board'!$B$2:$P$16,A18),COUNTIF('Current Board'!$R$6:$X$6,A18),COUNTIF('Current Board'!$R$11:$X$11,A18))","v":0},8]
["P",2,3,{"$f":"SUM(COUNTIF('Current Board'!$B$2:$P$16,A19),COUNTIF('Current Board'!$R$6:$X$6,A19),COUNTIF('Current Board'!$R$11:$X$11,A19))","v":0},2]
["Q",1,10,{"$f":"SUM(COUNTIF('Current Board'!$B$2:$P$16,A20),COUNTIF('Current Board'!$R$6:$X$6,A20),COUNTIF('Current Board'!$R$11:$X$11,A20))","v":0},1]
["R",6,1,{"$f":"SUM(COUNTIF('Current Board'!$B$2:$P$16,A21),COUNTIF('Current Board'!$R$6:$X$6,A21),COUNTIF('Current Board'!$R$11:$X$11,A21))","v":0},6]
["S",4,1,{"$f":"SUM(COUNTIF('Current Board'!$B$2:$P$16,A22),COUNTIF('Current Board'!$R$6:$X$6,A22),COUNTIF('Current Board'!$R$11:$X$11,A22))","v":0},4]
["T",6,1,{"$f":"SUM(COUNTIF('Current Board'!$B$2:$P$16,A23),COUNTIF('Current Board'!$R$6:$X$6,A23),COUNTIF('Current Board'!$R$11:$X$11,A23))","v":0},6]
["U",4,1,{"$f":"SUM(COUNTIF('Current Board'!$B$2:$P$16,A24),COUNTIF('Current Board'!$R$6:$X$6,A24),COUNTIF('Current Board'!$R$11:$X$11,A24))","v":0},4]
["V",2,4,{"$f":"SUM(COUNTIF('Current Board'!$B$2:$P$16,A25),COUNTIF('Current Board'!$R$6:$X$6,A25),COUNTIF('Current Board'!$R$11:$X$11,A25))","v":0},2]
["W",2,4,{"$f":"SUM(COUNTIF('Current Board'!$B$2:$P$16,A26),COUNTIF('Current Board'!$R$6:$X$6,A26),COUNTIF('Current Board'!$R$11:$X$11,A26))","v":0},2]
["X",1,8,{"$f":"SUM(COUNTIF('Current Board'!$B$2:$P$16,A27),COUNTIF('Current Board'!$R$6:$X$6,A27),COUNTIF('Current Board'!$R$11:$X$11,A27))","v":0},1]
["Y",2,4,{"$f":"SUM(COUNTIF('Current Board'!$B$2:$P$16,A28),COUNTIF('Current Board'!$R$6:$X$6,A28),COUNTIF('Current Board'!$R$11:$X$11,A28))","v":0},2]
["Z",1,10,{"$f":"SUM(COUNTIF('Current Board'!$B$2:$P$16,A29),COUNTIF('Current Board'!$R$6:$X$6,A29),COUNTIF('Current Board'!$R$11:$X$11,A29))","v":0},1]

{"sheet":"Tile Availability","index":4,"n_rows":101,"n_cols":7,"rows_kept":101,"cut":false,"hidden":true,"merged":[]}
["All Tiles",null,"Unique  Tile  Code","Tiles Available","For Formula","For Formula","Tiles Available - Compressed"]
["!",1,"!1",{"$f":"IF(VLOOKUP(A2,'Tiles Remaining'!A:E,5,FALSE)>='Tile Availability'!B2,'Tile Availability'!C2,\"\")","v":"!1"},1,1,{"$f":"MID($D$2&$D$3&$D$4&$D$5&$D$6&$D$7&$D$8&$D$9&$D$10&$D$11&$D$12&$D$13&$D$14&$D$15&$D$16&$D$17&$D$18&$D$19&$D$20&$D$21&$D$22&$D$23&$D$24&$D$25&$D$26&$D$27&$D$28&$D$29&$D$30&$D$31&$D$32&$D$33&$D$34&$D$35&$D$36&$D$37&$D$38&$D$39&$D$40&$D$41&$D$42&$D$43&$D$44&$D$45&$D$46&$D$47&$D$48&$D$49&$D$50&$D$51&$D$52&$D$53&$D$54&$D$55&$D$56&$D$57&$D$58&$D$59&$D$60&$D$61&$D$62&$D$63&$D$64&$D$65&$D$66&$D$67&$D$68&$D$69&$D$70&$D$71&$D$72&$D$73&$D$74&$D$75&$D$76&$D$77&$D$78&$D$79&$D$80&$D$81&$D$82&$D$83&$D$84&$D$85&$D$86&$D$87&$D$88&$D$89&$D$90&$D$91&$D$92&$D$93&$D$94&$D$95&$D$96&$D$97&$D$98&$D$99&$D$100&$D$101,E2,2)","v":"!1"}]
["!",2,"!2",{"$f":"IF(VLOOKUP(A3,'Tiles Remaining'!A:E,5,FALSE)>='Tile Availability'!B3,'Tile Availability'!C3,\"\")","v":"!2"},3,2,{"$f":"MID($D$2&$D$3&$D$4&$D$5&$D$6&$D$7&$D$8&$D$9&$D$10&$D$11&$D$12&$D$13&$D$14&$D$15&$D$16&$D$17&$D$18&$D$19&$D$20&$D$21&$D$22&$D$23&$D$24&$D$25&$D$26&$D$27&$D$28&$D$29&$D$30&$D$31&$D$32&$D$33&$D$34&$D$35&$D$36&$D$37&$D$38&$D$39&$D$40&$D$41&$D$42&$D$43&$D$44&$D$45&$D$46&$D$47&$D$48&$D$49&$D$50&$D$51&$D$52&$D$53&$D$54&$D$55&$D$56&$D$57&$D$58&$D$59&$D$60&$D$61&$D$62&$D$63&$D$64&$D$65&$D$66&$D$67&$D$68&$D$69&$D$70&$D$71&$D$72&$D$73&$D$74&$D$75&$D$76&$D$77&$D$78&$D$79&$D$80&$D$81&$D$82&$D$83&$D$84&$D$85&$D$86&$D$87&$D$88&$D$89&$D$90&$D$91&$D$92&$D$93&$D$94&$D$95&$D$96&$D$97&$D$98&$D$99&$D$100&$D$101,E3,2)","v":"!2"}]
["A",1,"A1",{"$f":"IF(VLOOKUP(A4,'Tiles Remaining'!A:E,5)>='Tile Availability'!B4,'Tile Availability'!C4,\"\")","v":"A1"},5,3,"A1"]
["A",2,"A2",{"$f":"IF(VLOOKUP(A5,'Tiles Remaining'!A:E,5)>='Tile Availability'!B5,'Tile Availability'!C5,\"\")","v":"A2"},7,4,"A2"]
["A",3,"A3",{"$f":"IF(VLOOKUP(A6,'Tiles Remaining'!A:E,5)>='Tile Availability'!B6,'Tile Availability'!C6,\"\")","v":"A3"},9,5,"A3"]
["A",4,"A4",{"$f":"IF(VLOOKUP(A7,'Tiles Remaining'!A:E,5)>='Tile Availability'!B7,'Tile Availability'!C7,\"\")","v":"A4"},11,6,"A4"]
["A",5,"A5",{"$f":"IF(VLOOKUP(A8,'Tiles Remaining'!A:E,5)>='Tile Availability'!B8,'Tile Availability'!C8,\"\")","v":"A5"},13,7,"A5"]
["A",6,"A6",{"$f":"IF(VLOOKUP(A9,'Tiles Remaining'!A:E,5)>='Tile Availability'!B9,'Tile Availability'!C9,\"\")","v":"A6"},15,8,"A6"]
["A",7,"A7",{"$f":"IF(VLOOKUP(A10,'Tiles Remaining'!A:E,5)>='Tile Availability'!B10,'Tile Availability'!C10,\"\")","v":"A7"},17,9,"A7"]
["A",8,"A8",{"$f":"IF(VLOOKUP(A11,'Tiles Remaining'!A:E,5)>='Tile Availability'!B11,'Tile Availability'!C11,\"\")","v":"A8"},19,10,"A8"]
["A",9,"A9",{"$f":"IF(VLOOKUP(A12,'Tiles Remaining'!A:E,5)>='Tile Availability'!B12,'Tile Availability'!C12,\"\")","v":"A9"},21,11,"A9"]
["B",1,"B1",{"$f":"IF(VLOOKUP(A13,'Tiles Remaining'!A:E,5)>='Tile Availability'!B13,'Tile Availability'!C13,\"\")","v":"B1"},23,12,"B1"]
["B",2,"B2",{"$f":"IF(VLOOKUP(A14,'Tiles Remaining'!A:E,5)>='Tile Availability'!B14,'Tile Availability'!C14,\"\")","v":"B2"},25,13,"B2"]
["C",1,"C1",{"$f":"IF(VLOOKUP(A15,'Tiles Remaining'!A:E,5)>='Tile Availability'!B15,'Tile Availability'!C15,\"\")","v":"C1"},27,14,"C1"]
["C",2,"C2",{"$f":"IF(VLOOKUP(A16,'Tiles Remaining'!A:E,5)>='Tile Availability'!B16,'Tile Availability'!C16,\"\")","v":"C2"},29,15,"C2"]
["D",1,"D1",{"$f":"IF(VLOOKUP(A17,'Tiles Remaining'!A:E,5)>='Tile Availability'!B17,'Tile Availability'!C17,\"\")","v":"D1"},31,16,"D1"]
["D",2,"D2",{"$f":"IF(VLOOKUP(A18,'Tiles Remaining'!A:E,5)>='Tile Availability'!B18,'Tile Availability'!C18,\"\")","v":"D2"},33,17,"D2"]
["D",3,"D3",{"$f":"IF(VLOOKUP(A19,'Tiles Remaining'!A:E,5)>='Tile Availability'!B19,'Tile Availability'!C19,\"\")","v":"D3"},35,18,"D3"]
["D",4,"D4",{"$f":"IF(VLOOKUP(A20,'Tiles Remaining'!A:E,5)>='Tile Availability'!B20,'Tile Availability'!C20,\"\")","v":"D4"},37,19,"D4"]
["E",1,"E1",{"$f":"IF(VLOOKUP(A21,'Tiles Remaining'!A:E,5)>='Tile Availability'!B21,'Tile Availability'!C21,\"\")","v":"E1"},39,20,"E1"]
["E",2,"E2",{"$f":"IF(VLOOKUP(A22,'Tiles Remaining'!A:E,5)>='Tile Availability'!B22,'Tile Availability'!C22,\"\")","v":"E2"},41,21,"E2"]
["E",3,"E3",{"$f":"IF(VLOOKUP(A23,'Tiles Remaining'!A:E,5)>='Tile Availability'!B23,'Tile Availability'!C23,\"\")","v":"E3"},43,22,"E3"]
["E",4,"E4",{"$f":"IF(VLOOKUP(A24,'Tiles Remaining'!A:E,5)>='Tile Availability'!B24,'Tile Availability'!C24,\"\")","v":"E4"},45,23,"E4"]
["E",5,"E5",{"$f":"IF(VLOOKUP(A25,'Tiles Remaining'!A:E,5)>='Tile Availability'!B25,'Tile Availability'!C25,\"\")","v":"E5"},47,24,"E5"]
["E",6,"E6",{"$f":"IF(VLOOKUP(A26,'Tiles Remaining'!A:E,5)>='Tile Availability'!B26,'Tile Availability'!C26,\"\")","v":"E6"},49,25,"E6"]
["E",7,"E7",{"$f":"IF(VLOOKUP(A27,'Tiles Remaining'!A:E,5)>='Tile Availability'!B27,'Tile Availability'!C27,\"\")","v":"E7"},51,26,"E7"]
["E",8,"E8",{"$f":"IF(VLOOKUP(A28,'Tiles Remaining'!A:E,5)>='Tile Availability'!B28,'Tile Availability'!C28,\"\")","v":"E8"},53,27,"E8"]
["E",9,"E9",{"$f":"IF(VLOOKUP(A29,'Tiles Remaining'!A:E,5)>='Tile Availability'!B29,'Tile Availability'!C29,\"\")","v":"E9"},55,28,"E9"]
["E",10,"EA",{"$f":"IF(VLOOKUP(A30,'Tiles Remaining'!A:E,5)>='Tile Availability'!B30,'Tile Availability'!C30,\"\")","v":"EA"},57,29,"EA"]
["E",11,"EB",{"$f":"IF(VLOOKUP(A31,'Tiles Remaining'!A:E,5)>='Tile Availability'!B31,'Tile Availability'!C31,\"\")","v":"EB"},59,30,"EB"]
["E",12,"EC",{"$f":"IF(VLOOKUP(A32,'Tiles Remaining'!A:E,5)>='Tile Availability'!B32,'Tile Availability'!C32,\"\")","v":"EC"},61,31,"EC"]
["F",1,"F1",{"$f":"IF(VLOOKUP(A33,'Tiles Remaining'!A:E,5)>='Tile Availability'!B33,'Tile Availability'!C33,\"\")","v":"F1"},63,32,"F1"]
["F",2,"F2",{"$f":"IF(VLOOKUP(A34,'Tiles Remaining'!A:E,5)>='Tile Availability'!B34,'Tile Availability'!C34,\"\")","v":"F2"},65,33,"F2"]
["G",1,"G1",{"$f":"IF(VLOOKUP(A35,'Tiles Remaining'!A:E,5)>='Tile Availability'!B35,'Tile Availability'!C35,\"\")","v":"G1"},67,34,"G1"]
["G",2,"G2",{"$f":"IF(VLOOKUP(A36,'Tiles Remaining'!A:E,5)>='Tile Availability'!B36,'Tile Availability'!C36,\"\")","v":"G2"},69,35,"G2"]
["G",3,"G3",{"$f":"IF(VLOOKUP(A37,'Tiles Remaining'!A:E,5)>='Tile Availability'!B37,'Tile Availability'!C37,\"\")","v":"G3"},71,36,"G3"]
["H",1,"H1",{"$f":"IF(VLOOKUP(A38,'Tiles Remaining'!A:E,5)>='Tile Availability'!B38,'Tile Availability'!C38,\"\")","v":"H1"},73,37,"H1"]
["H",2,"H2",{"$f":"IF(VLOOKUP(A39,'Tiles Remaining'!A:E,5)>='Tile Availability'!B39,'Tile Availability'!C39,\"\")","v":"H2"},75,38,"H2"]
["I",1,"I1",{"$f":"IF(VLOOKUP(A40,'Tiles Remaining'!A:E,5)>='Tile Availability'!B40,'Tile Availability'!C40,\"\")","v":"I1"},77,39,"I1"]
["I",2,"I2",{"$f":"IF(VLOOKUP(A41,'Tiles Remaining'!A:E,5)>='Tile Availability'!B41,'Tile Availability'!C41,\"\")","v":"I2"},79,40,"I2"]
["I",3,"I3",{"$f":"IF(VLOOKUP(A42,'Tiles Remaining'!A:E,5)>='Tile Availability'!B42,'Tile Availability'!C42,\"\")","v":"I3"},81,41,"I3"]
["I",4,"I4",{"$f":"IF(VLOOKUP(A43,'Tiles Remaining'!A:E,5)>='Tile Availability'!B43,'Tile Availability'!C43,\"\")","v":"I4"},83,42,"I4"]
["I",5,"I5",{"$f":"IF(VLOOKUP(A44,'Tiles Remaining'!A:E,5)>='Tile Availability'!B44,'Tile Availability'!C44,\"\")","v":"I5"},85,43,"I5"]
["I",6,"I6",{"$f":"IF(VLOOKUP(A45,'Tiles Remaining'!A:E,5)>='Tile Availability'!B45,'Tile Availability'!C45,\"\")","v":"I6"},87,44,"I6"]
["I",7,"I7",{"$f":"IF(VLOOKUP(A46,'Tiles Remaining'!A:E,5)>='Tile Availability'!B46,'Tile Availability'!C46,\"\")","v":"I7"},89,45,"I7"]
["I",8,"I8",{"$f":"IF(VLOOKUP(A47,'Tiles Remaining'!A:E,5)>='Tile Availability'!B47,'Tile Availability'!C47,\"\")","v":"I8"},91,46,"I8"]
["I",9,"I9",{"$f":"IF(VLOOKUP(A48,'Tiles Remaining'!A:E,5)>='Tile Availability'!B48,'Tile Availability'!C48,\"\")","v":"I9"},93,47,"I9"]
["J",1,"J1",{"$f":"IF(VLOOKUP(A49,'Tiles Remaining'!A:E,5)>='Tile Availability'!B49,'Tile Availability'!C49,\"\")","v":"J1"},95,48,"J1"]
["K",1,"K1",{"$f":"IF(VLOOKUP(A50,'Tiles Remaining'!A:E,5)>='Tile Availability'!B50,'Tile Availability'!C50,\"\")","v":"K1"},97,49,"K1"]
["L",1,"L1",{"$f":"IF(VLOOKUP(A51,'Tiles Remaining'!A:E,5)>='Tile Availability'!B51,'Tile Availability'!C51,\"\")","v":"L1"},99,50,"L1"]
["L",2,"L2",{"$f":"IF(VLOOKUP(A52,'Tiles Remaining'!A:E,5)>='Tile Availability'!B52,'Tile Availability'!C52,\"\")","v":"L2"},101,51,"L2"]
["L",3,"L3",{"$f":"IF(VLOOKUP(A53,'Tiles Remaining'!A:E,5)>='Tile Availability'!B53,'Tile Availability'!C53,\"\")","v":"L3"},103,52,"L3"]
["L",4,"L4",{"$f":"IF(VLOOKUP(A54,'Tiles Remaining'!A:E,5)>='Tile Availability'!B54,'Tile Availability'!C54,\"\")","v":"L4"},105,53,"L4"]
["M",1,"M1",{"$f":"IF(VLOOKUP(A55,'Tiles Remaining'!A:E,5)>='Tile Availability'!B55,'Tile Availability'!C55,\"\")","v":"M1"},107,54,"M1"]
["M",2,"M2",{"$f":"IF(VLOOKUP(A56,'Tiles Remaining'!A:E,5)>='Tile Availability'!B56,'Tile Availability'!C56,\"\")","v":"M2"},109,55,"M2"]
["N",1,"N1",{"$f":"IF(VLOOKUP(A57,'Tiles Remaining'!A:E,5)>='Tile Availability'!B57,'Tile Availability'!C57,\"\")","v":"N1"},111,56,"N1"]
["N",2,"N2",{"$f":"IF(VLOOKUP(A58,'Tiles Remaining'!A:E,5)>='Tile Availability'!B58,'Tile Availability'!C58,\"\")","v":"N2"},113,57,"N2"]
["N",3,"N3",{"$f":"IF(VLOOKUP(A59,'Tiles Remaining'!A:E,5)>='Tile Availability'!B59,'Tile Availability'!C59,\"\")","v":"N3"},115,58,"N3"]
["N",4,"N4",{"$f":"IF(VLOOKUP(A60,'Tiles Remaining'!A:E,5)>='Tile Availability'!B60,'Tile Availability'!C60,\"\")","v":"N4"},117,59,"N4"]
["N",5,"N5",{"$f":"IF(VLOOKUP(A61,'Tiles Remaining'!A:E,5)>='Tile Availability'!B61,'Tile Availability'!C61,\"\")","v":"N5"},119,60,"N5"]
["N",6,"N6",{"$f":"IF(VLOOKUP(A62,'Tiles Remaining'!A:E,5)>='Tile Availability'!B62,'Tile Availability'!C62,\"\")","v":"N6"},121,61,"N6"]
["O",1,"O1",{"$f":"IF(VLOOKUP(A63,'Tiles Remaining'!A:E,5)>='Tile Availability'!B63,'Tile Availability'!C63,\"\")","v":"O1"},123,62,"O1"]
["O",2,"O2",{"$f":"IF(VLOOKUP(A64,'Tiles Remaining'!A:E,5)>='Tile Availability'!B64,'Tile Availability'!C64,\"\")","v":"O2"},125,63,"O2"]
["O",3,"O3",{"$f":"IF(VLOOKUP(A65,'Tiles Remaining'!A:E,5)>='Tile Availability'!B65,'Tile Availability'!C65,\"\")","v":"O3"},127,64,"O3"]
["O",4,"O4",{"$f":"IF(VLOOKUP(A66,'Tiles Remaining'!A:E,5)>='Tile Availability'!B66,'Tile Availability'!C66,\"\")","v":"O4"},129,65,"O4"]
["O",5,"O5",{"$f":"IF(VLOOKUP(A67,'Tiles Remaining'!A:E,5)>='Tile Availability'!B67,'Tile Availability'!C67,\"\")","v":"O5"},131,66,{"$f":"MID($D$2&$D$3&$D$4&$D$5&$D$6&$D$7&$D$8&$D$9&$D$10&$D$11&$D$12&$D$13&$D$14&$D$15&$D$16&$D$17&$D$18&$D$19&$D$20&$D$21&$D$22&$D$23&$D$24&$D$25&$D$26&$D$27&$D$28&$D$29&$D$30&$D$31&$D$32&$D$33&$D$34&$D$35&$D$36&$D$37&$D$38&$D$39&$D$40&$D$41&$D$42&$D$43&$D$44&$D$45&$D$46&$D$47&$D$48&$D$49&$D$50&$D$51&$D$52&$D$53&$D$54&$D$55&$D$56&$D$57&$D$58&$D$59&$D$60&$D$61&$D$62&$D$63&$D$64&$D$65&$D$66&$D$67&$D$68&$D$69&$D$70&$D$71&$D$72&$D$73&$D$74&$D$75&$D$76&$D$77&$D$78&$D$79&$D$80&$D$81&$D$82&$D$83&$D$84&$D$85&$D$86&$D$87&$D$88&$D$89&$D$90&$D$91&$D$92&$D$93&$D$94&$D$95&$D$96&$D$97&$D$98&$D$99&$D$100&$D$101,E67,2)","v":"O5"}]
["O",6,"O6",{"$f":"IF(VLOOKUP(A68,'Tiles Remaining'!A:E,5)>='Tile Availability'!B68,'Tile Availability'!C68,\"\")","v":"O6"},133,67,"O6"]
["O",7,"O7",{"$f":"IF(VLOOKUP(A69,'Tiles Remaining'!A:E,5)>='Tile Availability'!B69,'Tile Availability'!C69,\"\")","v":"O7"},135,68,"O7"]
["O",8,"O8",{"$f":"IF(VLOOKUP(A70,'Tiles Remaining'!A:E,5)>='Tile Availability'!B70,'Tile Availability'!C70,\"\")","v":"O8"},137,69,"O8"]
["P",1,"P1",{"$f":"IF(VLOOKUP(A71,'Tiles Remaining'!A:E,5)>='Tile Availability'!B71,'Tile Availability'!C71,\"\")","v":"P1"},139,70,"P1"]
["P",2,"P2",{"$f":"IF(VLOOKUP(A72,'Tiles Remaining'!A:E,5)>='Tile Availability'!B72,'Tile Availability'!C72,\"\")","v":"P2"},141,71,"P2"]
["Q",1,"Q1",{"$f":"IF(VLOOKUP(A73,'Tiles Remaining'!A:E,5)>='Tile Availability'!B73,'Tile Availability'!C73,\"\")","v":"Q1"},143,72,"Q1"]
["R",1,"R1",{"$f":"IF(VLOOKUP(A74,'Tiles Remaining'!A:E,5)>='Tile Availability'!B74,'Tile Availability'!C74,\"\")","v":"R1"},145,73,"R1"]
["R",2,"R2",{"$f":"IF(VLOOKUP(A75,'Tiles Remaining'!A:E,5)>='Tile Availability'!B75,'Tile Availability'!C75,\"\")","v":"R2"},147,74,"R2"]
["R",3,"R3",{"$f":"IF(VLOOKUP(A76,'Tiles Remaining'!A:E,5)>='Tile Availability'!B76,'Tile Availability'!C76,\"\")","v":"R3"},149,75,"R3"]
["R",4,"R4",{"$f":"IF(VLOOKUP(A77,'Tiles Remaining'!A:E,5)>='Tile Availability'!B77,'Tile Availability'!C77,\"\")","v":"R4"},151,76,"R4"]
["R",5,"R5",{"$f":"IF(VLOOKUP(A78,'Tiles Remaining'!A:E,5)>='Tile Availability'!B78,'Tile Availability'!C78,\"\")","v":"R5"},153,77,"R5"]
["R",6,"R6",{"$f":"IF(VLOOKUP(A79,'Tiles Remaining'!A:E,5)>='Tile Availability'!B79,'Tile Availability'!C79,\"\")","v":"R6"},155,78,"R6"]
["S",1,"S1",{"$f":"IF(VLOOKUP(A80,'Tiles Remaining'!A:E,5)>='Tile Availability'!B80,'Tile Availability'!C80,\"\")","v":"S1"},157,79,"S1"]
["S",2,"S2",{"$f":"IF(VLOOKUP(A81,'Tiles Remaining'!A:E,5)>='Tile Availability'!B81,'Tile Availability'!C81,\"\")","v":"S2"},159,80,"S2"]
["S",3,"S3",{"$f":"IF(VLOOKUP(A82,'Tiles Remaining'!A:E,5)>='Tile Availability'!B82,'Tile Availability'!C82,\"\")","v":"S3"},161,81,"S3"]
["S",4,"S4",{"$f":"IF(VLOOKUP(A83,'Tiles Remaining'!A:E,5)>='Tile Availability'!B83,'Tile Availability'!C83,\"\")","v":"S4"},163,82,"S4"]
["T",1,"T1",{"$f":"IF(VLOOKUP(A84,'Tiles Remaining'!A:E,5)>='Tile Availability'!B84,'Tile Availability'!C84,\"\")","v":"T1"},165,83,"T1"]
["T",2,"T2",{"$f":"IF(VLOOKUP(A85,'Tiles Remaining'!A:E,5)>='Tile Availability'!B85,'Tile Availability'!C85,\"\")","v":"T2"},167,84,"T2"]
["T",3,"T3",{"$f":"IF(VLOOKUP(A86,'Tiles Remaining'!A:E,5)>='Tile Availability'!B86,'Tile Availability'!C86,\"\")","v":"T3"},169,85,"T3"]
["T",4,"T4",{"$f":"IF(VLOOKUP(A87,'Tiles Remaining'!A:E,5)>='Tile Availability'!B87,'Tile Availability'!C87,\"\")","v":"T4"},171,86,"T4"]
["T",5,"T5",{"$f":"IF(VLOOKUP(A88,'Tiles Remaining'!A:E,5)>='Tile Availability'!B88,'Tile Availability'!C88,\"\")","v":"T5"},173,87,"T5"]
["T",6,"T6",{"$f":"IF(VLOOKUP(A89,'Tiles Remaining'!A:E,5)>='Tile Availability'!B89,'Tile Availability'!C89,\"\")","v":"T6"},175,88,"T6"]
["U",1,"U1",{"$f":"IF(VLOOKUP(A90,'Tiles Remaining'!A:E,5)>='Tile Availability'!B90,'Tile Availability'!C90,\"\")","v":"U1"},177,89,"U1"]
["U",2,"U2",{"$f":"IF(VLOOKUP(A91,'Tiles Remaining'!A:E,5)>='Tile Availability'!B91,'Tile Availability'!C91,\"\")","v":"U2"},179,90,"U2"]
["U",3,"U3",{"$f":"IF(VLOOKUP(A92,'Tiles Remaining'!A:E,5)>='Tile Availability'!B92,'Tile Availability'!C92,\"\")","v":"U3"},181,91,"U3"]
["U",4,"U4",{"$f":"IF(VLOOKUP(A93,'Tiles Remaining'!A:E,5)>='Tile Availability'!B93,'Tile Availability'!C93,\"\")","v":"U4"},183,92,"U4"]
["V",1,"V1",{"$f":"IF(VLOOKUP(A94,'Tiles Remaining'!A:E,5)>='Tile Availability'!B94,'Tile Availability'!C94,\"\")","v":"V1"},185,93,"V1"]
["V",2,"V2",{"$f":"IF(VLOOKUP(A95,'Tiles Remaining'!A:E,5)>='Tile Availability'!B95,'Tile Availability'!C95,\"\")","v":"V2"},187,94,"V2"]
["W",1,"W1",{"$f":"IF(VLOOKUP(A96,'Tiles Remaining'!A:E,5)>='Tile Availability'!B96,'Tile Availability'!C96,\"\")","v":"W1"},189,95,"W1"]
["W",2,"W2",{"$f":"IF(VLOOKUP(A97,'Tiles Remaining'!A:E,5)>='Tile Availability'!B97,'Tile Availability'!C97,\"\")","v":"W2"},191,96,"W2"]
["X",1,"X1",{"$f":"IF(VLOOKUP(A98,'Tiles Remaining'!A:E,5)>='Tile Availability'!B98,'Tile Availability'!C98,\"\")","v":"X1"},193,97,"X1"]
["Y",1,"Y1",{"$f":"IF(VLOOKUP(A99,'Tiles Remaining'!A:E,5)>='Tile Availability'!B99,'Tile Availability'!C99,\"\")","v":"Y1"},195,98,"Y1"]
["Y",2,"Y2",{"$f":"IF(VLOOKUP(A100,'Tiles Remaining'!A:E,5)>='Tile Availability'!B100,'Tile Availability'!C100,\"\")","v":"Y2"},197,99,"Y2"]
["Z",1,"Z1",{"$f":"IF(VLOOKUP(A101,'Tiles Remaining'!A:E,5)>='Tile Availability'!B101,'Tile Availability'!C101,\"\")","v":"Z1"},199,100,"Z1"]

{"sheet":"Standard Board","index":5,"n_rows":0,"n_cols":0,"rows_kept":0,"cut":false,"hidden":true,"merged":[[7,17,7,18]]}

{"sheet":"Standard Board Slots","index":6,"n_rows":226,"n_cols":1,"rows_kept":226,"cut":false,"hidden":true,"merged":[]}
["Board Slots"]
["B2"]
["B3"]
["B4"]
["B5"]
["B6"]
["B7"]
["B8"]
["B9"]
["B10"]
["B11"]
["B12"]
["B13"]
["B14"]
["B15"]
["B16"]
["C2"]
["C3"]
["C4"]
["C5"]
["C6"]
["C7"]
["C8"]
["C9"]
["C10"]
["C11"]
["C12"]
["C13"]
["C14"]
["C15"]
["C16"]
["D2"]
["D3"]
["D4"]
["D5"]
["D6"]
["D7"]
["D8"]
["D9"]
["D10"]
["D11"]
["D12"]
["D13"]
["D14"]
["D15"]
["D16"]
["E2"]
["E3"]
["E4"]
["E5"]
["E6"]
["E7"]
["E8"]
["E9"]
["E10"]
["E11"]
["E12"]
["E13"]
["E14"]
["E15"]
["E16"]
["F2"]
["F3"]
["F4"]
["F5"]
["F6"]
["F7"]
["F8"]
["F9"]
["F10"]
["F11"]
["F12"]
["F13"]
["F14"]
["F15"]
["F16"]
["G2"]
["G3"]
["G4"]
["G5"]
["G6"]
["G7"]
["G8"]
["G9"]
["G10"]
["G11"]
["G12"]
["G13"]
["G14"]
["G15"]
["G16"]
["H2"]
["H3"]
["H4"]
["H5"]
["H6"]
["H7"]
["H8"]
["H9"]
["H10"]
["H11"]
["H12"]
["H13"]
["H14"]
["H15"]
["H16"]
["I2"]
["I3"]
["I4"]
["I5"]
["I6"]
["I7"]
["I8"]
["I9"]
["I10"]
["I11"]
["I12"]
["I13"]
["I14"]
["I15"]
["I16"]
["J2"]
["J3"]
["J4"]
["J5"]
["J6"]
["J7"]
["J8"]
["J9"]
["J10"]
["J11"]
["J12"]
["J13"]
["J14"]
["J15"]
["J16"]
["K2"]
["K3"]
["K4"]
["K5"]
["K6"]
["K7"]
["K8"]
["K9"]
["K10"]
["K11"]
["K12"]
["K13"]
["K14"]
["K15"]
["K16"]
["L2"]
["L3"]
["L4"]
["L5"]
["L6"]
["L7"]
["L8"]
["L9"]
["L10"]
["L11"]
["L12"]
["L13"]
["L14"]
["L15"]
["L16"]
["M2"]
["M3"]
["M4"]
["M5"]
["M6"]
["M7"]
["M8"]
["M9"]
["M10"]
["M11"]
["M12"]
["M13"]
["M14"]
["M15"]
["M16"]
["N2"]
["N3"]
["N4"]
["N5"]
["N6"]
["N7"]
["N8"]
["N9"]
["N10"]
["N11"]
["N12"]
["N13"]
["N14"]
["N15"]
["N16"]
["O2"]
["O3"]
["O4"]
["O5"]
["O6"]
["O7"]
["O8"]
["O9"]
["O10"]
["O11"]
["O12"]
["O13"]
["O14"]
["O15"]
["O16"]
["P2"]
["P3"]
["P4"]
["P5"]
["P6"]
["P7"]
["P8"]
["P9"]
["P10"]
["P11"]
["P12"]
["P13"]
["P14"]
["P15"]
["P16"]

{"sheet":"Standard Scrabble Tiles","index":7,"n_rows":29,"n_cols":3,"rows_kept":29,"cut":false,"hidden":true,"merged":[]}
["SCRABBLE TILES"]
["Letter","Tiles","Points"]
["Blank",2,0]
["A",9,1]
["B",2,3]
["C",2,3]
["D",4,2]
["E",12,1]
["F",2,4]
["G",3,2]
["H",2,4]
["I",9,1]
["J",1,8]
["K",1,5]
["L",4,1]
["M",2,3]
["N",6,1]
["O",8,1]
["P",2,3]
["Q",1,10]
["R",6,1]
["S",4,1]
["T",6,1]
["U",4,1]
["V",2,4]
["W",2,4]
["X",1,8]
["Y",2,4]
["Z",1,10]

{"sheet":"Draw","index":8,"n_rows":22,"n_cols":10,"rows_kept":22,"cut":false,"hidden":true,"merged":[]}
["TILES AVAILABLE (LIVE)",{"$f":"'Current Board'!U13","v":100}]
["TILES AVAILABLE (STATIC)"]
["RANDOM NUMBER",{"$f":"RANDBETWEEN(2,B1+1)","v":6}]
[]
["PLAYER 1"]
["EMPTY SLOT COUNT",{"$f":"COUNTIF('Current Board'!R6:X6,\"\")","v":7}]
[null,null,null,null,null,null,null,null,null,"Notes"]
[null,"SLOT 1","SLOT 2","SLOT 3","SLOT 4","SLOT 5","SLOT 6","SLOT 7",null,"Copy-Paste Value-Tiles Available (Live) into Tiles Available (Static)"]
["Current",null,null,null,null,null,null,null,null,"Copy formula into New"]
["New",null,null,null,null,null,null,null,null,"Copy-Paste Value-Tiles Available (Live) into Tiles Available (Static)"]
["Total",{"$f":"IF(B9<>\"\",B9,IF(B10<>\"\",B10,\"\"))","v":""},{"$f":"IF(C9<>\"\",C9,IF(C10<>\"\",C10,\"\"))","v":""},"","","","","",null,".."]
["Formula to be copied",{"$f":"LEFT(VLOOKUP(RANDBETWEEN(1,$B$2),'Tile Availability'!$F:$G,2,FALSE),1)","v":{"$error":"#NUM!"}},{"$f":"LEFT(VLOOKUP(RANDBETWEEN(1,$B$2),'Tile Availability'!$F:$G,2,FALSE),1)","v":{"$error":"#NUM!"}},{"$f":"LEFT(VLOOKUP(RANDBETWEEN(1,$B$2),'Tile Availability'!$F:$G,2,FALSE),1)","v":{"$error":"#NUM!"}},{"$f":"LEFT(VLOOKUP(RANDBETWEEN(1,$B$2),'Tile Availability'!$F:$G,2,FALSE),1)","v":{"$error":"#NUM!"}},{"$f":"LEFT(VLOOKUP(RANDBETWEEN(1,$B$2),'Tile Availability'!$F:$G,2,FALSE),1)","v":{"$error":"#NUM!"}},{"$f":"LEFT(VLOOKUP(RANDBETWEEN(1,$B$2),'Tile Availability'!$F:$G,2,FALSE),1)","v":{"$error":"#NUM!"}},{"$f":"LEFT(VLOOKUP(RANDBETWEEN(1,$B$2),'Tile Availability'!$F:$G,2,FALSE),1)","v":{"$error":"#NUM!"}},null,"Copy-Paste Value-Total (7 slots) into Current (7 slots)"]
["Net",{"$f":"IF(ISERROR(B11),\"\",IF('Current Board'!$U$12=1,IF('Prior Board'!R23=\"\",\"\",B11),B11))","v":""},{"$f":"IF(ISERROR(C11),\"\",IF('Current Board'!$U$12=1,IF('Prior Board'!S23=\"\",\"\",C11),C11))","v":""},{"$f":"IF(ISERROR(D11),\"\",IF('Current Board'!$U$12=1,IF('Prior Board'!T23=\"\",\"\",D11),D11))","v":""},{"$f":"IF(ISERROR(E11),\"\",IF('Current Board'!$U$12=1,IF('Prior Board'!U23=\"\",\"\",E11),E11))","v":""},{"$f":"IF(ISERROR(F11),\"\",IF('Current Board'!$U$12=1,IF('Prior Board'!V23=\"\",\"\",F11),F11))","v":""},{"$f":"IF(ISERROR(G11),\"\",IF('Current Board'!$U$12=1,IF('Prior Board'!W23=\"\",\"\",G11),G11))","v":""},{"$f":"IF(ISERROR(H11),\"\",IF('Current Board'!$U$12=1,IF('Prior Board'!X23=\"\",\"\",H11),H11))","v":""},null,"Clear New Row"]
["PLAYER 2"]
["EMPTY SLOT COUNT",{"$f":"COUNTIF('Current Board'!R11:X11,\"\")","v":7}]
[]
[null,"SLOT 1","SLOT 2","SLOT 3","SLOT 4","SLOT 5","SLOT 6","SLOT 7"]
["Current"]
["New"]
["Total",{"$f":"IF(B18<>\"\",B18,IF(B19<>\"\",B19,\"\"))","v":""},{"$f":"IF(C18<>\"\",C18,IF(C19<>\"\",C19,\"\"))","v":""},{"$f":"IF(D18<>\"\",D18,IF(D19<>\"\",D19,\"\"))","v":""},{"$f":"IF(E18<>\"\",E18,IF(E19<>\"\",E19,\"\"))","v":""},{"$f":"IF(F18<>\"\",F18,IF(F19<>\"\",F19,\"\"))","v":""},{"$f":"IF(G18<>\"\",G18,IF(G19<>\"\",G19,\"\"))","v":""},{"$f":"IF(H18<>\"\",H18,IF(H19<>\"\",H19,\"\"))","v":""}]
["Formula to be copied",{"$f":"LEFT(VLOOKUP(RANDBETWEEN(1,$B$2),'Tile Availability'!$F:$G,2,FALSE),1)","v":{"$error":"#NUM!"}},{"$f":"LEFT(VLOOKUP(RANDBETWEEN(1,$B$2),'Tile Availability'!$F:$G,2,FALSE),1)","v":{"$error":"#NUM!"}},{"$f":"LEFT(VLOOKUP(RANDBETWEEN(1,$B$2),'Tile Availability'!$F:$G,2,FALSE),1)","v":{"$error":"#NUM!"}},{"$f":"LEFT(VLOOKUP(RANDBETWEEN(1,$B$2),'Tile Availability'!$F:$G,2,FALSE),1)","v":{"$error":"#NUM!"}},{"$f":"LEFT(VLOOKUP(RANDBETWEEN(1,$B$2),'Tile Availability'!$F:$G,2,FALSE),1)","v":{"$error":"#NUM!"}},{"$f":"LEFT(VLOOKUP(RANDBETWEEN(1,$B$2),'Tile Availability'!$F:$G,2,FALSE),1)","v":{"$error":"#NUM!"}},{"$f":"LEFT(VLOOKUP(RANDBETWEEN(1,$B$2),'Tile Availability'!$F:$G,2,FALSE),1)","v":{"$error":"#NUM!"}}]
["Net",{"$f":"IF(ISERROR(B20),\"\",IF('Current Board'!$U$12=2,IF('Prior Board'!R23=\"\",\"\",B20),B20))","v":""},{"$f":"IF(ISERROR(C20),\"\",IF('Current Board'!$U$12=2,IF('Prior Board'!S23=\"\",\"\",C20),C20))","v":""},{"$f":"IF(ISERROR(D20),\"\",IF('Current Board'!$U$12=2,IF('Prior Board'!T23=\"\",\"\",D20),D20))","v":""},{"$f":"IF(ISERROR(E20),\"\",IF('Current Board'!$U$12=2,IF('Prior Board'!U23=\"\",\"\",E20),E20))","v":""},{"$f":"IF(ISERROR(F20),\"\",IF('Current Board'!$U$12=2,IF('Prior Board'!V23=\"\",\"\",F20),F20))","v":""},{"$f":"IF(ISERROR(G20),\"\",IF('Current Board'!$U$12=2,IF('Prior Board'!W23=\"\",\"\",G20),G20))","v":""},{"$f":"IF(ISERROR(H20),\"\",IF('Current Board'!$U$12=2,IF('Prior Board'!X23=\"\",\"\",H20),H20))","v":""}]

{"sheet":"Standard Board Scores","index":9,"n_rows":226,"n_cols":21,"rows_kept":226,"cut":false,"hidden":true,"merged":[]}
[null,null,null,null,null,null,null,null,null,null,null,null,null,null,null,null,null,"Board Slots","Letter Code","Row","Column"]
[null,"TW",null,null,"DL",null,null,null,"TW",null,null,null,"DL",null,null,"TW",null,"B2",{"$f":"INDEX($B$2:$P$16,T2,1)","v":"TW"},1,1]
[null,null,"DW",null,null,null,"TL",null,null,null,"TL",null,null,null,"DW",null,null,"B3",0,2,1]
[null,null,null,"DW",null,null,null,"DL",null,"DL",null,null,null,"DW",null,null,null,"B4",0,3,1]
[null,"DL",null,null,"DW",null,null,null,"DL",null,null,null,"DW",null,null,"DL",null,"B5","DL",4,1]
[null,null,null,null,null,"DW",null,null,null,null,null,"DW",null,null,null,null,null,"B6",0,5,1]
[null,null,"TL",null,null,null,"TL",null,null,null,"TL",null,null,null,"TL",null,null,"B7",0,6,1]
[null,null,null,"DL",null,null,null,"DL",null,"DL",null,null,null,"DL",null,null,null,"B8",0,7,1]
[null,"TW",null,null,"DL",null,null,null,"DW",null,null,null,"DL",null,null,"TW",null,"B9","TW",8,1]
[null,null,null,"DL",null,null,null,"DL",null,"DL",null,null,null,"DL",null,null,null,"B10",0,9,1]
[null,null,"TL",null,null,null,"TL",null,null,null,"TL",null,null,null,"TL",null,null,"B11",0,10,1]
[null,null,null,null,null,"DW",null,null,null,null,null,"DW",null,null,null,null,null,"B12",0,11,1]
[null,"DL",null,null,"DW",null,null,null,"DL",null,null,null,"DW",null,null,"DL",null,"B13","DL",12,1]
[null,null,null,"DW",null,null,null,"DL",null,"DL",null,null,null,"DW",null,null,null,"B14",0,13,1]
[null,null,"DW",null,null,null,"TL",null,null,null,"TL",null,null,null,"DW",null,null,"B15",0,14,1]
[null,"TW",null,null,"DL",null,null,null,"TW",null,null,null,"DL",null,null,"TW",null,"B16","TW",15,1]
[null,null,null,null,null,null,null,null,null,null,null,null,null,null,null,null,null,"C2",{"$f":"INDEX($B$2:$P$16,T17,2)","v":0},1,2]
[null,null,null,null,null,null,null,null,null,null,null,null,null,null,null,null,null,"C3","DW",2,2]
[null,null,null,null,null,null,null,null,null,null,null,null,null,null,null,null,null,"C4",0,3,2]
[null,null,null,null,null,null,null,null,null,null,null,null,null,null,null,null,null,"C5",0,4,2]
[null,null,null,null,null,null,null,null,null,null,null,null,null,null,null,null,null,"C6",0,5,2]
[null,null,null,null,null,null,null,null,null,null,null,null,null,null,null,null,null,"C7","TL",6,2]
[null,null,null,null,null,null,null,null,null,null,null,null,null,null,null,null,null,"C8",0,7,2]
[null,null,null,null,null,null,null,null,null,null,null,null,null,null,null,null,null,"C9",0,8,2]
[null,null,null,null,null,null,null,null,null,null,null,null,null,null,null,null,null,"C10",0,9,2]
[null,null,null,null,null,null,null,null,null,null,null,null,null,null,null,null,null,"C11","TL",10,2]
[null,null,null,null,null,null,null,null,null,null,null,null,null,null,null,null,null,"C12",0,11,2]
[null,null,null,null,null,null,null,null,null,null,null,null,null,null,null,null,null,"C13",0,12,2]
[null,null,null,null,null,null,null,null,null,null,null,null,null,null,null,null,null,"C14",0,13,2]
[null,null,null,null,null,null,null,null,null,null,null,null,null,null,null,null,null,"C15","DW",14,2]
[null,null,null,null,null,null,null,null,null,null,null,null,null,null,null,null,null,"C16",0,15,2]
[null,null,null,null,null,null,null,null,null,null,null,null,null,null,null,null,null,"D2",{"$f":"INDEX($B$2:$P$16,T32,3)","v":0},1,3]
[null,null,null,null,null,null,null,null,null,null,null,null,null,null,null,null,null,"D3",0,2,3]
[null,null,null,null,null,null,null,null,null,null,null,null,null,null,null,null,null,"D4","DW",3,3]
[null,null,null,null,null,null,null,null,null,null,null,null,null,null,null,null,null,"D5",0,4,3]
[null,null,null,null,null,null,null,null,null,null,null,null,null,null,null,null,null,"D6",0,5,3]
[null,null,null,null,null,null,null,null,null,null,null,null,null,null,null,null,null,"D7",0,6,3]
[null,null,null,null,null,null,null,null,null,null,null,null,null,null,null,null,null,"D8","DL",7,3]
[null,null,null,null,null,null,null,null,null,null,null,null,null,null,null,null,null,"D9",0,8,3]
[null,null,null,null,null,null,null,null,null,null,null,null,null,null,null,null,null,"D10","DL",9,3]
[null,null,null,null,null,null,null,null,null,null,null,null,null,null,null,null,null,"D11",0,10,3]
[null,null,null,null,null,null,null,null,null,null,null,null,null,null,null,null,null,"D12",0,11,3]
[null,null,null,null,null,null,null,null,null,null,null,null,null,null,null,null,null,"D13",0,12,3]
[null,null,null,null,null,null,null,null,null,null,null,null,null,null,null,null,null,"D14","DW",13,3]
[null,null,null,null,null,null,null,null,null,null,null,null,null,null,null,null,null,"D15",0,14,3]
[null,null,null,null,null,null,null,null,null,null,null,null,null,null,null,null,null,"D16",0,15,3]
[null,null,null,null,null,null,null,null,null,null,null,null,null,null,null,null,null,"E2",{"$f":"INDEX($B$2:$P$16,T47,4)","v":"DL"},1,4]
[null,null,null,null,null,null,null,null,null,null,null,null,null,null,null,null,null,"E3",0,2,4]
[null,null,null,null,null,null,null,null,null,null,null,null,null,null,null,null,null,"E4",0,3,4]
[null,null,null,null,null,null,null,null,null,null,null,null,null,null,null,null,null,"E5","DW",4,4]
[null,null,null,null,null,null,null,null,null,null,null,null,null,null,null,null,null,"E6",0,5,4]
[null,null,null,null,null,null,null,null,null,null,null,null,null,null,null,null,null,"E7",0,6,4]
[null,null,null,null,null,null,null,null,null,null,null,null,null,null,null,null,null,"E8",0,7,4]
[null,null,null,null,null,null,null,null,null,null,null,null,null,null,null,null,null,"E9","DL",8,4]
[null,null,null,null,null,null,null,null,null,null,null,null,null,null,null,null,null,"E10",0,9,4]
[null,null,null,null,null,null,null,null,null,null,null,null,null,null,null,null,null,"E11",0,10,4]
[null,null,null,null,null,null,null,null,null,null,null,null,null,null,null,null,null,"E12",0,11,4]
[null,null,null,null,null,null,null,null,null,null,null,null,null,null,null,null,null,"E13","DW",12,4]
[null,null,null,null,null,null,null,null,null,null,null,null,null,null,null,null,null,"E14",0,13,4]
[null,null,null,null,null,null,null,null,null,null,null,null,null,null,null,null,null,"E15",0,14,4]
[null,null,null,null,null,null,null,null,null,null,null,null,null,null,null,null,null,"E16","DL",15,4]
[null,null,null,null,null,null,null,null,null,null,null,null,null,null,null,null,null,"F2",{"$f":"INDEX($B$2:$P$16,T62,5)","v":0},1,5]
[null,null,null,null,null,null,null,null,null,null,null,null,null,null,null,null,null,"F3",0,2,5]
[null,null,null,null,null,null,null,null,null,null,null,null,null,null,null,null,null,"F4",0,3,5]
[null,null,null,null,null,null,null,null,null,null,null,null,null,null,null,null,null,"F5",0,4,5]
[null,null,null,null,null,null,null,null,null,null,null,null,null,null,null,null,null,"F6","DW",5,5]
[null,null,null,null,null,null,null,null,null,null,null,null,null,null,null,null,null,"F7",0,6,5]
[null,null,null,null,null,null,null,null,null,null,null,null,null,null,null,null,null,"F8",0,7,5]
[null,null,null,null,null,null,null,null,null,null,null,null,null,null,null,null,null,"F9",0,8,5]
[null,null,null,null,null,null,null,null,null,null,null,null,null,null,null,null,null,"F10",0,9,5]
[null,null,null,null,null,null,null,null,null,null,null,null,null,null,null,null,null,"F11",0,10,5]
[null,null,null,null,null,null,null,null,null,null,null,null,null,null,null,null,null,"F12","DW",11,5]
[null,null,null,null,null,null,null,null,null,null,null,null,null,null,null,null,null,"F13",0,12,5]
[null,null,null,null,null,null,null,null,null,null,null,null,null,null,null,null,null,"F14",0,13,5]
[null,null,null,null,null,null,null,null,null,null,null,null,null,null,null,null,null,"F15",0,14,5]
[null,null,null,null,null,null,null,null,null,null,null,null,null,null,null,null,null,"F16",0,15,5]
[null,null,null,null,null,null,null,null,null,null,null,null,null,null,null,null,null,"G2",{"$f":"INDEX($B$2:$P$16,T77,6)","v":0},1,6]
[null,null,null,null,null,null,null,null,null,null,null,null,null,null,null,null,null,"G3","TL",2,6]
[null,null,null,null,null,null,null,null,null,null,null,null,null,null,null,null,null,"G4",0,3,6]
[null,null,null,null,null,null,null,null,null,null,null,null,null,null,null,null,null,"G5",0,4,6]
[null,null,null,null,null,null,null,null,null,null,null,null,null,null,null,null,null,"G6",0,5,6]
[null,null,null,null,null,null,null,null,null,null,null,null,null,null,null,null,null,"G7","TL",6,6]
[null,null,null,null,null,null,null,null,null,null,null,null,null,null,null,null,null,"G8",0,7,6]
[null,null,null,null,null,null,null,null,null,null,null,null,null,null,null,null,null,"G9",0,8,6]
[null,null,null,null,null,null,null,null,null,null,null,null,null,null,null,null,null,"G10",0,9,6]
[null,null,null,null,null,null,null,null,null,null,null,null,null,null,null,null,null,"G11","TL",10,6]
[null,null,null,null,null,null,null,null,null,null,null,null,null,null,null,null,null,"G12",0,11,6]
[null,null,null,null,null,null,null,null,null,null,null,null,null,null,null,null,null,"G13",0,12,6]
[null,null,null,null,null,null,null,null,null,null,null,null,null,null,null,null,null,"G14",0,13,6]
[null,null,null,null,null,null,null,null,null,null,null,null,null,null,null,null,null,"G15","TL",14,6]
[null,null,null,null,null,null,null,null,null,null,null,null,null,null,null,null,null,"G16",0,15,6]
[null,null,null,null,null,null,null,null,null,null,null,null,null,null,null,null,null,"H2",{"$f":"INDEX($B$2:$P$16,T92,7)","v":0},1,7]
[null,null,null,null,null,null,null,null,null,null,null,null,null,null,null,null,null,"H3",0,2,7]
[null,null,null,null,null,null,null,null,null,null,null,null,null,null,null,null,null,"H4","DL",3,7]
[null,null,null,null,null,null,null,null,null,null,null,null,null,null,null,null,null,"H5",0,4,7]
[null,null,null,null,null,null,null,null,null,null,null,null,null,null,null,null,null,"H6",0,5,7]
[null,null,null,null,null,null,null,null,null,null,null,null,null,null,null,null,null,"H7",0,6,7]
[null,null,null,null,null,null,null,null,null,null,null,null,null,null,null,null,null,"H8","DL",7,7]
[null,null,null,null,null,null,null,null,null,null,null,null,null,null,null,null,null,"H9",0,8,7]
[null,null,null,null,null,null,null,null,null,null,null,null,null,null,null,null,null,"H10","DL",9,7]
[null,null,null,null,null,null,null,null,null,null,null,null,null,null,null,null,null,"H11",0,10,7]
[null,null,null,null,null,null,null,null,null,null,null,null,null,null,null,null,null,"H12",0,11,7]
[null,null,null,null,null,null,null,null,null,null,null,null,null,null,null,null,null,"H13",0,12,7]
[null,null,null,null,null,null,null,null,null,null,null,null,null,null,null,null,null,"H14","DL",13,7]
[null,null,null,null,null,null,null,null,null,null,null,null,null,null,null,null,null,"H15",0,14,7]
[null,null,null,null,null,null,null,null,null,null,null,null,null,null,null,null,null,"H16",0,15,7]
[null,null,null,null,null,null,null,null,null,null,null,null,null,null,null,null,null,"I2",{"$f":"INDEX($B$2:$P$16,T107,8)","v":"TW"},1,8]
[null,null,null,null,null,null,null,null,null,null,null,null,null,null,null,null,null,"I3",0,2,8]
[null,null,null,null,null,null,null,null,null,null,null,null,null,null,null,null,null,"I4",0,3,8]
[null,null,null,null,null,null,null,null,null,null,null,null,null,null,null,null,null,"I5","DL",4,8]
[null,null,null,null,null,null,null,null,null,null,null,null,null,null,null,null,null,"I6",0,5,8]
[null,null,null,null,null,null,null,null,null,null,null,null,null,null,null,null,null,"I7",0,6,8]
[null,null,null,null,null,null,null,null,null,null,null,null,null,null,null,null,null,"I8",0,7,8]
[null,null,null,null,null,null,null,null,null,null,null,null,null,null,null,null,null,"I9","DW",8,8]
[null,null,null,null,null,null,null,null,null,null,null,null,null,null,null,null,null,"I10",0,9,8]
[null,null,null,null,null,null,null,null,null,null,null,null,null,null,null,null,null,"I11",0,10,8]
[null,null,null,null,null,null,null,null,null,null,null,null,null,null,null,null,null,"I12",0,11,8]
[null,null,null,null,null,null,null,null,null,null,null,null,null,null,null,null,null,"I13","DL",12,8]
[null,null,null,null,null,null,null,null,null,null,null,null,null,null,null,null,null,"I14",0,13,8]
[null,null,null,null,null,null,null,null,null,null,null,null,null,null,null,null,null,"I15",0,14,8]
[null,null,null,null,null,null,null,null,null,null,null,null,null,null,null,null,null,"I16","TW",15,8]
[null,null,null,null,null,null,null,null,null,null,null,null,null,null,null,null,null,"J2",{"$f":"INDEX($B$2:$P$16,T122,9)","v":0},1,9]
[null,null,null,null,null,null,null,null,null,null,null,null,null,null,null,null,null,"J3",0,2,9]
[null,null,null,null,null,null,null,null,null,null,null,null,null,null,null,null,null,"J4","DL",3,9]
[null,null,null,null,null,null,null,null,null,null,null,null,null,null,null,null,null,"J5",0,4,9]
[null,null,null,null,null,null,null,null,null,null,null,null,null,null,null,null,null,"J6",0,5,9]
[null,null,null,null,null,null,null,null,null,null,null,null,null,null,null,null,null,"J7",0,6,9]
[null,null,null,null,null,null,null,null,null,null,null,null,null,null,null,null,null,"J8","DL",7,9]
[null,null,null,null,null,null,null,null,null,null,null,null,null,null,null,null,null,"J9",0,8,9]
[null,null,null,null,null,null,null,null,null,null,null,null,null,null,null,null,null,"J10","DL",9,9]
[null,null,null,null,null,null,null,null,null,null,null,null,null,null,null,null,null,"J11",0,10,9]
[null,null,null,null,null,null,null,null,null,null,null,null,null,null,null,null,null,"J12",0,11,9]
[null,null,null,null,null,null,null,null,null,null,null,null,null,null,null,null,null,"J13",0,12,9]
[null,null,null,null,null,null,null,null,null,null,null,null,null,null,null,null,null,"J14","DL",13,9]
[null,null,null,null,null,null,null,null,null,null,null,null,null,null,null,null,null,"J15",0,14,9]
[null,null,null,null,null,null,null,null,null,null,null,null,null,null,null,null,null,"J16",0,15,9]
[null,null,null,null,null,null,null,null,null,null,null,null,null,null,null,null,null,"K2",{"$f":"INDEX($B$2:$P$16,T137,10)","v":0},1,10]
[null,null,null,null,null,null,null,null,null,null,null,null,null,null,null,null,null,"K3","TL",2,10]
[null,null,null,null,null,null,null,null,null,null,null,null,null,null,null,null,null,"K4",0,3,10]
[null,null,null,null,null,null,null,null,null,null,null,null,null,null,null,null,null,"K5",0,4,10]
[null,null,null,null,null,null,null,null,null,null,null,null,null,null,null,null,null,"K6",0,5,10]
[null,null,null,null,null,null,null,null,null,null,null,null,null,null,null,null,null,"K7","TL",6,10]
[null,null,null,null,null,null,null,null,null,null,null,null,null,null,null,null,null,"K8",0,7,10]
[null,null,null,null,null,null,null,null,null,null,null,null,null,null,null,null,null,"K9",0,8,10]
[null,null,null,null,null,null,null,null,null,null,null,null,null,null,null,null,null,"K10",0,9,10]
[null,null,null,null,null,null,null,null,null,null,null,null,null,null,null,null,null,"K11","TL",10,10]
[null,null,null,null,null,null,null,null,null,null,null,null,null,null,null,null,null,"K12",0,11,10]
[null,null,null,null,null,null,null,null,null,null,null,null,null,null,null,null,null,"K13",0,12,10]
[null,null,null,null,null,null,null,null,null,null,null,null,null,null,null,null,null,"K14",0,13,10]
[null,null,null,null,null,null,null,null,null,null,null,null,null,null,null,null,null,"K15","TL",14,10]
[null,null,null,null,null,null,null,null,null,null,null,null,null,null,null,null,null,"K16",0,15,10]
[null,null,null,null,null,null,null,null,null,null,null,null,null,null,null,null,null,"L2",{"$f":"INDEX($B$2:$P$16,T152,11)","v":0},1,11]
[null,null,null,null,null,null,null,null,null,null,null,null,null,null,null,null,null,"L3",0,2,11]
[null,null,null,null,null,null,null,null,null,null,null,null,null,null,null,null,null,"L4",0,3,11]
[null,null,null,null,null,null,null,null,null,null,null,null,null,null,null,null,null,"L5",0,4,11]
[null,null,null,null,null,null,null,null,null,null,null,null,null,null,null,null,null,"L6","DW",5,11]
[null,null,null,null,null,null,null,null,null,null,null,null,null,null,null,null,null,"L7",0,6,11]
[null,null,null,null,null,null,null,null,null,null,null,null,null,null,null,null,null,"L8",0,7,11]
[null,null,null,null,null,null,null,null,null,null,null,null,null,null,null,null,null,"L9",0,8,11]
[null,null,null,null,null,null,null,null,null,null,null,null,null,null,null,null,null,"L10",0,9,11]
[null,null,null,null,null,null,null,null,null,null,null,null,null,null,null,null,null,"L11",0,10,11]
[null,null,null,null,null,null,null,null,null,null,null,null,null,null,null,null,null,"L12","DW",11,11]
[null,null,null,null,null,null,null,null,null,null,null,null,null,null,null,null,null,"L13",0,12,11]
[null,null,null,null,null,null,null,null,null,null,null,null,null,null,null,null,null,"L14",0,13,11]
[null,null,null,null,null,null,null,null,null,null,null,null,null,null,null,null,null,"L15",0,14,11]
[null,null,null,null,null,null,null,null,null,null,null,null,null,null,null,null,null,"L16",0,15,11]
[null,null,null,null,null,null,null,null,null,null,null,null,null,null,null,null,null,"M2",{"$f":"INDEX($B$2:$P$16,T167,12)","v":"DL"},1,12]
[null,null,null,null,null,null,null,null,null,null,null,null,null,null,null,null,null,"M3",0,2,12]
[null,null,null,null,null,null,null,null,null,null,null,null,null,null,null,null,null,"M4",0,3,12]
[null,null,null,null,null,null,null,null,null,null,null,null,null,null,null,null,null,"M5","DW",4,12]
[null,null,null,null,null,null,null,null,null,null,null,null,null,null,null,null,null,"M6",0,5,12]
[null,null,null,null,null,null,null,null,null,null,null,null,null,null,null,null,null,"M7",0,6,12]
[null,null,null,null,null,null,null,null,null,null,null,null,null,null,null,null,null,"M8",0,7,12]
[null,null,null,null,null,null,null,null,null,null,null,null,null,null,null,null,null,"M9","DL",8,12]
[null,null,null,null,null,null,null,null,null,null,null,null,null,null,null,null,null,"M10",0,9,12]
[null,null,null,null,null,null,null,null,null,null,null,null,null,null,null,null,null,"M11",0,10,12]
[null,null,null,null,null,null,null,null,null,null,null,null,null,null,null,null,null,"M12",0,11,12]
[null,null,null,null,null,null,null,null,null,null,null,null,null,null,null,null,null,"M13","DW",12,12]
[null,null,null,null,null,null,null,null,null,null,null,null,null,null,null,null,null,"M14",0,13,12]
[null,null,null,null,null,null,null,null,null,null,null,null,null,null,null,null,null,"M15",0,14,12]
[null,null,null,null,null,null,null,null,null,null,null,null,null,null,null,null,null,"M16","DL",15,12]
[null,null,null,null,null,null,null,null,null,null,null,null,null,null,null,null,null,"N2",{"$f":"INDEX($B$2:$P$16,T182,13)","v":0},1,13]
[null,null,null,null,null,null,null,null,null,null,null,null,null,null,null,null,null,"N3",0,2,13]
[null,null,null,null,null,null,null,null,null,null,null,null,null,null,null,null,null,"N4","DW",3,13]
[null,null,null,null,null,null,null,null,null,null,null,null,null,null,null,null,null,"N5",0,4,13]
[null,null,null,null,null,null,null,null,null,null,null,null,null,null,null,null,null,"N6",0,5,13]
[null,null,null,null,null,null,null,null,null,null,null,null,null,null,null,null,null,"N7",0,6,13]
[null,null,null,null,null,null,null,null,null,null,null,null,null,null,null,null,null,"N8","DL",7,13]
[null,null,null,null,null,null,null,null,null,null,null,null,null,null,null,null,null,"N9",0,8,13]
[null,null,null,null,null,null,null,null,null,null,null,null,null,null,null,null,null,"N10","DL",9,13]
[null,null,null,null,null,null,null,null,null,null,null,null,null,null,null,null,null,"N11",0,10,13]
[null,null,null,null,null,null,null,null,null,null,null,null,null,null,null,null,null,"N12",0,11,13]
[null,null,null,null,null,null,null,null,null,null,null,null,null,null,null,null,null,"N13",0,12,13]
[null,null,null,null,null,null,null,null,null,null,null,null,null,null,null,null,null,"N14","DW",13,13]
[null,null,null,null,null,null,null,null,null,null,null,null,null,null,null,null,null,"N15",0,14,13]
[null,null,null,null,null,null,null,null,null,null,null,null,null,null,null,null,null,"N16",0,15,13]
[null,null,null,null,null,null,null,null,null,null,null,null,null,null,null,null,null,"O2",{"$f":"INDEX($B$2:$P$16,T197,14)","v":0},1,14]
[null,null,null,null,null,null,null,null,null,null,null,null,null,null,null,null,null,"O3","DW",2,14]
[null,null,null,null,null,null,null,null,null,null,null,null,null,null,null,null,null,"O4",0,3,14]
[null,null,null,null,null,null,null,null,null,null,null,null,null,null,null,null,null,"O5",0,4,14]
[null,null,null,null,null,null,null,null,null,null,null,null,null,null,null,null,null,"O6",0,5,14]
[null,null,null,null,null,null,null,null,null,null,null,null,null,null,null,null,null,"O7","TL",6,14]
[null,null,null,null,null,null,null,null,null,null,null,null,null,null,null,null,null,"O8",0,7,14]
[null,null,null,null,null,null,null,null,null,null,null,null,null,null,null,null,null,"O9",0,8,14]
[null,null,null,null,null,null,null,null,null,null,null,null,null,null,null,null,null,"O10",0,9,14]
[null,null,null,null,null,null,null,null,null,null,null,null,null,null,null,null,null,"O11","TL",10,14]
[null,null,null,null,null,null,null,null,null,null,null,null,null,null,null,null,null,"O12",0,11,14]
[null,null,null,null,null,null,null,null,null,null,null,null,null,null,null,null,null,"O13",0,12,14]
[null,null,null,null,null,null,null,null,null,null,null,null,null,null,null,null,null,"O14",0,13,14]
[null,null,null,null,null,null,null,null,null,null,null,null,null,null,null,null,null,"O15","DW",14,14]
[null,null,null,null,null,null,null,null,null,null,null,null,null,null,null,null,null,"O16",0,15,14]
[null,null,null,null,null,null,null,null,null,null,null,null,null,null,null,null,null,"P2",{"$f":"INDEX($B$2:$P$16,T212,15)","v":"TW"},1,15]
[null,null,null,null,null,null,null,null,null,null,null,null,null,null,null,null,null,"P3",0,2,15]
[null,null,null,null,null,null,null,null,null,null,null,null,null,null,null,null,null,"P4",0,3,15]
[null,null,null,null,null,null,null,null,null,null,null,null,null,null,null,null,null,"P5","DL",4,15]
[null,null,null,null,null,null,null,null,null,null,null,null,null,null,null,null,null,"P6",0,5,15]
[null,null,null,null,null,null,null,null,null,null,null,null,null,null,null,null,null,"P7",0,6,15]
[null,null,null,null,null,null,null,null,null,null,null,null,null,null,null,null,null,"P8",0,7,15]
[null,null,null,null,null,null,null,null,null,null,null,null,null,null,null,null,null,"P9","TW",8,15]
[null,null,null,null,null,null,null,null,null,null,null,null,null,null,null,null,null,"P10",0,9,15]
[null,null,null,null,null,null,null,null,null,null,null,null,null,null,null,null,null,"P11",0,10,15]
[null,null,null,null,null,null,null,null,null,null,null,null,null,null,null,null,null,"P12",0,11,15]
[null,null,null,null,null,null,null,null,null,null,null,null,null,null,null,null,null,"P13","DL",12,15]
[null,null,null,null,null,null,null,null,null,null,null,null,null,null,null,null,null,"P14",0,13,15]
[null,null,null,null,null,null,null,null,null,null,null,null,null,null,null,null,null,"P15",0,14,15]
[null,null,null,null,null,null,null,null,null,null,null,null,null,null,null,null,null,"P16","TW",15,15]

{"sheet":"Scorekeeping","index":10,"n_rows":175,"n_cols":27,"rows_kept":175,"cut":false,"hidden":true,"merged":[]}
[null,null,null,"First",{"$f":"IF(AND(E2<>\"\",F2=\"\"),\"Last\",\"\")","v":""},{"$f":"IF(AND(F2<>\"\",G2=\"\"),\"Last\",\"\")","v":""},"","","","",null,"Vertical - Interstitial"]
[null,"New",null,{"$f":"'Prior Board'!AH20","v":""},{"$f":"'Prior Board'!AI20","v":""},{"$f":"'Prior Board'!AJ20","v":""},{"$f":"'Prior Board'!AK20","v":""},{"$f":"'Prior Board'!AL20","v":""},{"$f":"'Prior Board'!AM20","v":""},{"$f":"'Prior Board'!AN20","v":""},null,1,2,3,4,5,6,7,8,9,10,11,12,13,14]
[null,"Tile Type",null,{"$f":"IF(ISERROR(VLOOKUP(D2,'Standard Board Scores'!$R:$S,2,FALSE)),0,VLOOKUP(D2,'Standard Board Scores'!$R:$S,2,FALSE))","v":0},{"$f":"IF(ISERROR(VLOOKUP(E2,'Standard Board Scores'!$R:$S,2,FALSE)),0,VLOOKUP(E2,'Standard Board Scores'!$R:$S,2,FALSE))","v":0},{"$f":"IF(ISERROR(VLOOKUP(F2,'Standard Board Scores'!$R:$S,2,FALSE)),0,VLOOKUP(F2,'Standard Board Scores'!$R:$S,2,FALSE))","v":0},{"$f":"IF(ISERROR(VLOOKUP(G2,'Standard Board Scores'!$R:$S,2,FALSE)),0,VLOOKUP(G2,'Standard Board Scores'!$R:$S,2,FALSE))","v":0},{"$f":"IF(ISERROR(VLOOKUP(H2,'Standard Board Scores'!$R:$S,2,FALSE)),0,VLOOKUP(H2,'Standard Board Scores'!$R:$S,2,FALSE))","v":0},{"$f":"IF(ISERROR(VLOOKUP(I2,'Standard Board Scores'!$R:$S,2,FALSE)),0,VLOOKUP(I2,'Standard Board Scores'!$R:$S,2,FALSE))","v":0},{"$f":"IF(ISERROR(VLOOKUP(J2,'Standard Board Scores'!$R:$S,2,FALSE)),0,VLOOKUP(J2,'Standard Board Scores'!$R:$S,2,FALSE))","v":0},{"$f":"D2","v":""},{"$f":"IF(AND(K3<>\"\",RIGHT(K3,2)<>\"16\",RIGHT(K3,2)<>\"17\"),CONCATENATE(LEFT(K3),VALUE(REPLACE(K3,1,1,\"\"))+1),\"\")","v":""},{"$f":"IF(AND(L3<>\"\",RIGHT(L3,2)<>\"16\",RIGHT(L3,2)<>\"17\"),CONCATENATE(LEFT(L3),VALUE(REPLACE(L3,1,1,\"\"))+1),\"\")","v":""},"","","","","","","","","","","",""]
[null,"Letter",null,{"$f":"'Prior Board'!R20","v":""},{"$f":"'Prior Board'!S20","v":""},{"$f":"'Prior Board'!T20","v":""},{"$f":"'Prior Board'!U20","v":""},{"$f":"'Prior Board'!V20","v":""},{"$f":"'Prior Board'!W20","v":""},{"$f":"'Prior Board'!X20","v":""},{"$f":"IFERROR(HLOOKUP(K3,$D$2:$J$8,1,FALSE),\"\")","v":""},{"$f":"IFERROR(HLOOKUP(L3,$D$2:$J$8,1,FALSE),\"\")","v":""},"","","","","","","","","","","","",""]
[null,"Letter Score",null,{"$f":"VLOOKUP(D4,'Tiles Remaining'!$A:$C,3,FALSE)","v":{"$error":"#N/A"}},{"$f":"VLOOKUP(E4,'Tiles Remaining'!$A:$C,3,FALSE)","v":{"$error":"#N/A"}},{"$f":"VLOOKUP(F4,'Tiles Remaining'!$A:$C,3,FALSE)","v":{"$error":"#N/A"}},{"$f":"VLOOKUP(G4,'Tiles Remaining'!$A:$C,3,FALSE)","v":{"$error":"#N/A"}},{"$f":"VLOOKUP(H4,'Tiles Remaining'!$A:$C,3,FALSE)","v":{"$error":"#N/A"}},{"$f":"VLOOKUP(I4,'Tiles Remaining'!$A:$C,3,FALSE)","v":{"$error":"#N/A"}},{"$f":"VLOOKUP(J4,'Tiles Remaining'!$A:$C,3,FALSE)","v":{"$error":"#N/A"}},{"$f":"IFERROR(IF(AND(K4=\"\",VALUE(REPLACE(K3,1,1,\"\"))<VALUE(REPLACE(HLOOKUP(\"Last\",$D$1:$J$2,2,FALSE),1,1,\"\"))),K3,\"\"),\"\")","v":""},{"$f":"IFERROR(IF(AND(L4=\"\",VALUE(REPLACE(L3,1,1,\"\"))<VALUE(REPLACE(HLOOKUP(\"Last\",$D$1:$J$2,2,FALSE),1,1,\"\"))),L3,\"\"),\"\")","v":""},"","","","","","","","","","","","",""]
[null,"Interstitial Test",null,null,{"$f":"IF($D$10=\"Vertical\",IFERROR(IF(VALUE(RIGHT(E2,1))<>(VALUE(RIGHT(D2,1))+1),\"Break\",\"\"),\"\"),IF($D$10=\"Horizontal\",IFERROR(IF(CODE(LEFT(E2,1))<>(CODE(LEFT(D2,1))+1),\"Break\",\"\"),\"\")))","v":false},{"$f":"IF($D$10=\"Vertical\",IFERROR(IF(VALUE(RIGHT(F2,1))<>(VALUE(RIGHT(E2,1))+1),\"Break\",\"\"),\"\"),IF($D$10=\"Horizontal\",IFERROR(IF(CODE(LEFT(F2,1))<>(CODE(LEFT(E2,1))+1),\"Break\",\"\"),\"\")))","v":false},false,false,false,false,{"$f":"IF(AND(K5<>\"\",$D$9=\"Vertical\",$D$11=\"Yes\"),INDEX('Current Board'!$B$2:$P$16,VLOOKUP(Scorekeeping!K3,'Standard Board Scores'!$R:$U,3,FALSE),VLOOKUP(Scorekeeping!K3,'Standard Board Scores'!$R:$U,4,FALSE)),\"\")","v":""},{"$f":"IF(AND(L5<>\"\",$D$9=\"Vertical\",$D$11=\"Yes\"),INDEX('Current Board'!$B$2:$P$16,VLOOKUP(Scorekeeping!L3,'Standard Board Scores'!$R:$U,3,FALSE),VLOOKUP(Scorekeeping!L3,'Standard Board Scores'!$R:$U,4,FALSE)),\"\")","v":""},{"$f":"IF(AND(M5<>\"\",$D$9=\"Vertical\",$D$11=\"Yes\"),INDEX('Current Board'!$B$2:$P$16,VLOOKUP(Scorekeeping!M3,'Standard Board Scores'!$R:$U,3,FALSE),VLOOKUP(Scorekeeping!M3,'Standard Board Scores'!$R:$U,4,FALSE)),\"\")","v":""},{"$f":"IF(AND(N5<>\"\",$D$9=\"Vertical\",$D$11=\"Yes\"),INDEX('Current Board'!$B$2:$P$16,VLOOKUP(Scorekeeping!N3,'Standard Board Scores'!$R:$U,3,FALSE),VLOOKUP(Scorekeeping!N3,'Standard Board Scores'!$R:$U,4,FALSE)),\"\")","v":""},{"$f":"IF(AND(O5<>\"\",$D$9=\"Vertical\",$D$11=\"Yes\"),INDEX('Current Board'!$B$2:$P$16,VLOOKUP(Scorekeeping!O3,'Standard Board Scores'!$R:$U,3,FALSE),VLOOKUP(Scorekeeping!O3,'Standard Board Scores'!$R:$U,4,FALSE)),\"\")","v":""},{"$f":"IF(AND(P5<>\"\",$D$9=\"Vertical\",$D$11=\"Yes\"),INDEX('Current Board'!$B$2:$P$16,VLOOKUP(Scorekeeping!P3,'Standard Board Scores'!$R:$U,3,FALSE),VLOOKUP(Scorekeeping!P3,'Standard Board Scores'!$R:$U,4,FALSE)),\"\")","v":""},{"$f":"IF(AND(Q5<>\"\",$D$9=\"Vertical\",$D$11=\"Yes\"),INDEX('Current Board'!$B$2:$P$16,VLOOKUP(Scorekeeping!Q3,'Standard Board Scores'!$R:$U,3,FALSE),VLOOKUP(Scorekeeping!Q3,'Standard Board Scores'!$R:$U,4,FALSE)),\"\")","v":""},{"$f":"IF(AND(R5<>\"\",$D$9=\"Vertical\",$D$11=\"Yes\"),INDEX('Current Board'!$B$2:$P$16,VLOOKUP(Scorekeeping!R3,'Standard Board Scores'!$R:$U,3,FALSE),VLOOKUP(Scorekeeping!R3,'Standard Board Scores'!$R:$U,4,FALSE)),\"\")","v":""},{"$f":"IF(AND(S5<>\"\",$D$9=\"Vertical\",$D$11=\"Yes\"),INDEX('Current Board'!$B$2:$P$16,VLOOKUP(Scorekeeping!S3,'Standard Board Scores'!$R:$U,3,FALSE),VLOOKUP(Scorekeeping!S3,'Standard Board Scores'!$R:$U,4,FALSE)),\"\")","v":""},{"$f":"IF(AND(T5<>\"\",$D$9=\"Vertical\",$D$11=\"Yes\"),INDEX('Current Board'!$B$2:$P$16,VLOOKUP(Scorekeeping!T3,'Standard Board Scores'!$R:$U,3,FALSE),VLOOKUP(Scorekeeping!T3,'Standard Board Scores'!$R:$U,4,FALSE)),\"\")","v":""},{"$f":"IF(AND(U5<>\"\",$D$9=\"Vertical\",$D$11=\"Yes\"),INDEX('Current Board'!$B$2:$P$16,VLOOKUP(Scorekeeping!U3,'Standard Board Scores'!$R:$U,3,FALSE),VLOOKUP(Scorekeeping!U3,'Standard Board Scores'!$R:$U,4,FALSE)),\"\")","v":""},{"$f":"IF(AND(V5<>\"\",$D$9=\"Vertical\",$D$11=\"Yes\"),INDEX('Current Board'!$B$2:$P$16,VLOOKUP(Scorekeeping!V3,'Standard Board Scores'!$R:$U,3,FALSE),VLOOKUP(Scorekeeping!V3,'Standard Board Scores'!$R:$U,4,FALSE)),\"\")","v":""},{"$f":"IF(AND(W5<>\"\",$D$9=\"Vertical\",$D$11=\"Yes\"),INDEX('Current Board'!$B$2:$P$16,VLOOKUP(Scorekeeping!W3,'Standard Board Scores'!$R:$U,3,FALSE),VLOOKUP(Scorekeeping!W3,'Standard Board Scores'!$R:$U,4,FALSE)),\"\")","v":""},{"$f":"IF(AND(X5<>\"\",$D$9=\"Vertical\",$D$11=\"Yes\"),INDEX('Current Board'!$B$2:$P$16,VLOOKUP(Scorekeeping!X3,'Standard Board Scores'!$R:$U,3,FALSE),VLOOKUP(Scorekeeping!X3,'Standard Board Scores'!$R:$U,4,FALSE)),\"\")","v":""},{"$f":"IF(AND(Y5<>\"\",$D$9=\"Vertical\",$D$11=\"Yes\"),INDEX('Current Board'!$B$2:$P$16,VLOOKUP(Scorekeeping!Y3,'Standard Board Scores'!$R:$U,3,FALSE),VLOOKUP(Scorekeeping!Y3,'Standard Board Scores'!$R:$U,4,FALSE)),\"\")","v":""}]
[null,"Interim Letter Score (by Letter)",null,{"$f":"IF(ISERROR(D5),0,IF(D3=\"TL\",D5*3,IF(D3=\"DL\",D5*2,D5)))","v":0},0,0,0,0,0,0,{"$f":"IFERROR(VLOOKUP(K6,'Tiles Remaining'!$A:$C,3,FALSE),\"\")","v":""},{"$f":"IFERROR(VLOOKUP(L6,'Tiles Remaining'!$A:$C,3,FALSE),\"\")","v":""},{"$f":"IFERROR(VLOOKUP(M6,'Tiles Remaining'!$A:$C,3,FALSE),\"\")","v":""},{"$f":"IFERROR(VLOOKUP(N6,'Tiles Remaining'!$A:$C,3,FALSE),\"\")","v":""},{"$f":"IFERROR(VLOOKUP(O6,'Tiles Remaining'!$A:$C,3,FALSE),\"\")","v":""},{"$f":"IFERROR(VLOOKUP(P6,'Tiles Remaining'!$A:$C,3,FALSE),\"\")","v":""},{"$f":"IFERROR(VLOOKUP(Q6,'Tiles Remaining'!$A:$C,3,FALSE),\"\")","v":""},{"$f":"IFERROR(VLOOKUP(R6,'Tiles Remaining'!$A:$C,3,FALSE),\"\")","v":""},{"$f":"IFERROR(VLOOKUP(S6,'Tiles Remaining'!$A:$C,3,FALSE),\"\")","v":""},{"$f":"IFERROR(VLOOKUP(T6,'Tiles Remaining'!$A:$C,3,FALSE),\"\")","v":""},{"$f":"IFERROR(VLOOKUP(U6,'Tiles Remaining'!$A:$C,3,FALSE),\"\")","v":""},{"$f":"IFERROR(VLOOKUP(V6,'Tiles Remaining'!$A:$C,3,FALSE),\"\")","v":""},{"$f":"IFERROR(VLOOKUP(W6,'Tiles Remaining'!$A:$C,3,FALSE),\"\")","v":""},{"$f":"IFERROR(VLOOKUP(X6,'Tiles Remaining'!$A:$C,3,FALSE),\"\")","v":""},{"$f":"IFERROR(VLOOKUP(Y6,'Tiles Remaining'!$A:$C,3,FALSE),\"\")","v":""},{"$f":"SUM(K7:Y7)","v":0}]
[null,"Interim Letter Score (Total)",null,{"$f":"SUM(D7:J7)","v":0}]
[null,"Horizontal or Vertical or Single Letter",null,{"$f":"IF(D2=\"\",\"\",IF(E2=\"\",\"Single Letter\",IF(LEFT(D2,1)=LEFT(E2,1),\"Vertical\",\"Horizontal\")))","v":""},null,null,null,null,null,null,null,"Horizontal - Interstitial"]
[null,"Horizontal or Vertical",null,{"$f":"IF(D9<>\"Single Letter\",D9,IF(SUM(Z90,Z95)>SUM(Z170,Z175),\"Vertical\",\"Horizontal\"))","v":""},null,null,null,null,null,null,null,1,2,3,4,5,6,7,8,9,10,11,12,13,14]
[null,"Interstitial",null,{"$f":"IF(OR(E6=\"Break\",F6=\"Break\",G6=\"Break\",H6=\"Break\",I6=\"Break\",J6=\"Break\"),\"Yes\",\"No\")","v":"No"},null,null,null,null,null,null,{"$f":"D2","v":""},{"$f":"IF(AND(K11<>\"\",LEFT(K11,1)<>\"P\",LEFT(K11,1)<>\"Q\"),CONCATENATE(CHAR(CODE(LEFT(K11,1))+1),REPLACE(K11,1,1,\"\")),\"\")","v":""},{"$f":"IF(AND(L11<>\"\",LEFT(L11,1)<>\"P\",LEFT(L11,1)<>\"Q\"),CONCATENATE(CHAR(CODE(LEFT(L11,1))+1),REPLACE(L11,1,1,\"\")),\"\")","v":""},"","","","","","","","","","","",""]
[null,"Interim Word Score (Pre DW)",null,{"$f":"IF(D10=\"\",\"\",IF(D10=\"Vertical\",SUM(D8,Z90,Z95,Z7),IF(D10=\"Horizontal\",SUM(D8,Z170,Z175,Z15),IF(D10=\"Single Letter\",SUM(D8,IF(SUM(Z90,Z95)>SUM(Z170,Z175),SUM(Z90,Z95),SUM(Z170,Z175)))))))","v":""},null,null,null,null,null,null,{"$f":"IFERROR(HLOOKUP(K11,$D$2:$J$8,1,FALSE),\"\")","v":""},{"$f":"IFERROR(HLOOKUP(L11,$D$2:$J$8,1,FALSE),\"\")","v":""},{"$f":"IFERROR(HLOOKUP(M11,$D$2:$J$8,1,FALSE),\"\")","v":""},{"$f":"IFERROR(HLOOKUP(N11,$D$2:$J$8,1,FALSE),\"\")","v":""},{"$f":"IFERROR(HLOOKUP(O11,$D$2:$J$8,1,FALSE),\"\")","v":""},{"$f":"IFERROR(HLOOKUP(P11,$D$2:$J$8,1,FALSE),\"\")","v":""},{"$f":"IFERROR(HLOOKUP(Q11,$D$2:$J$8,1,FALSE),\"\")","v":""},{"$f":"IFERROR(HLOOKUP(R11,$D$2:$J$8,1,FALSE),\"\")","v":""},{"$f":"IFERROR(HLOOKUP(S11,$D$2:$J$8,1,FALSE),\"\")","v":""},{"$f":"IFERROR(HLOOKUP(T11,$D$2:$J$8,1,FALSE),\"\")","v":""},{"$f":"IFERROR(HLOOKUP(U11,$D$2:$J$8,1,FALSE),\"\")","v":""},{"$f":"IFERROR(HLOOKUP(V11,$D$2:$J$8,1,FALSE),\"\")","v":""},{"$f":"IFERROR(HLOOKUP(W11,$D$2:$J$8,1,FALSE),\"\")","v":""},{"$f":"IFERROR(HLOOKUP(X11,$D$2:$J$8,1,FALSE),\"\")","v":""},{"$f":"IFERROR(HLOOKUP(Y11,$D$2:$J$8,1,FALSE),\"\")","v":""}]
[null,"Interim Word Score (Post DW)",null,{"$f":"IF(OR(D3=\"DW\",E3=\"DW\",F3=\"DW\",G3=\"DW\",H3=\"DW\",I3=\"DW\",J3=\"DW\"),2*D12,D12)","v":""},null,null,null,null,null,null,{"$f":"IFERROR(IF(AND(K12=\"\",CODE(LEFT(K11,1))<CODE(LEFT(HLOOKUP(\"Last\",$D$1:$J$2,2,FALSE),1))),K11,\"\"),\"\")","v":""},{"$f":"IFERROR(IF(AND(L12=\"\",CODE(LEFT(L11,1))<CODE(LEFT(HLOOKUP(\"Last\",$D$1:$J$2,2,FALSE),1))),L11,\"\"),\"\")","v":""},"","","","","","","","","","","","",""]
[null,"Main Word Score (Post TW)",null,{"$f":"IF(OR(D3=\"TW\",E3=\"TW\",F3=\"TW\",G3=\"TW\",H3=\"TW\",I3=\"TW\",J3=\"TW\"),3*D13,D13)","v":""},null,null,null,null,null,null,{"$f":"IF(AND(K13<>\"\",$D$9=\"Horizontal\",$D$11=\"Yes\"),INDEX('Current Board'!$B$2:$P$16,VLOOKUP(Scorekeeping!K11,'Standard Board Scores'!$R:$U,3,FALSE),VLOOKUP(Scorekeeping!K11,'Standard Board Scores'!$R:$U,4,FALSE)),\"\")","v":""},{"$f":"IF(AND(L13<>\"\",$D$9=\"Horizontal\",$D$11=\"Yes\"),INDEX('Current Board'!$B$2:$P$16,VLOOKUP(Scorekeeping!L11,'Standard Board Scores'!$R:$U,3,FALSE),VLOOKUP(Scorekeeping!L11,'Standard Board Scores'!$R:$U,4,FALSE)),\"\")","v":""},{"$f":"IF(AND(M13<>\"\",$D$9=\"Horizontal\",$D$11=\"Yes\"),INDEX('Current Board'!$B$2:$P$16,VLOOKUP(Scorekeeping!M11,'Standard Board Scores'!$R:$U,3,FALSE),VLOOKUP(Scorekeeping!M11,'Standard Board Scores'!$R:$U,4,FALSE)),\"\")","v":""},{"$f":"IF(AND(N13<>\"\",$D$9=\"Horizontal\",$D$11=\"Yes\"),INDEX('Current Board'!$B$2:$P$16,VLOOKUP(Scorekeeping!N11,'Standard Board Scores'!$R:$U,3,FALSE),VLOOKUP(Scorekeeping!N11,'Standard Board Scores'!$R:$U,4,FALSE)),\"\")","v":""},{"$f":"IF(AND(O13<>\"\",$D$9=\"Horizontal\",$D$11=\"Yes\"),INDEX('Current Board'!$B$2:$P$16,VLOOKUP(Scorekeeping!O11,'Standard Board Scores'!$R:$U,3,FALSE),VLOOKUP(Scorekeeping!O11,'Standard Board Scores'!$R:$U,4,FALSE)),\"\")","v":""},{"$f":"IF(AND(P13<>\"\",$D$9=\"Horizontal\",$D$11=\"Yes\"),INDEX('Current Board'!$B$2:$P$16,VLOOKUP(Scorekeeping!P11,'Standard Board Scores'!$R:$U,3,FALSE),VLOOKUP(Scorekeeping!P11,'Standard Board Scores'!$R:$U,4,FALSE)),\"\")","v":""},{"$f":"IF(AND(Q13<>\"\",$D$9=\"Horizontal\",$D$11=\"Yes\"),INDEX('Current Board'!$B$2:$P$16,VLOOKUP(Scorekeeping!Q11,'Standard Board Scores'!$R:$U,3,FALSE),VLOOKUP(Scorekeeping!Q11,'Standard Board Scores'!$R:$U,4,FALSE)),\"\")","v":""},{"$f":"IF(AND(R13<>\"\",$D$9=\"Horizontal\",$D$11=\"Yes\"),INDEX('Current Board'!$B$2:$P$16,VLOOKUP(Scorekeeping!R11,'Standard Board Scores'!$R:$U,3,FALSE),VLOOKUP(Scorekeeping!R11,'Standard Board Scores'!$R:$U,4,FALSE)),\"\")","v":""},{"$f":"IF(AND(S13<>\"\",$D$9=\"Horizontal\",$D$11=\"Yes\"),INDEX('Current Board'!$B$2:$P$16,VLOOKUP(Scorekeeping!S11,'Standard Board Scores'!$R:$U,3,FALSE),VLOOKUP(Scorekeeping!S11,'Standard Board Scores'!$R:$U,4,FALSE)),\"\")","v":""},{"$f":"IF(AND(T13<>\"\",$D$9=\"Horizontal\",$D$11=\"Yes\"),INDEX('Current Board'!$B$2:$P$16,VLOOKUP(Scorekeeping!T11,'Standard Board Scores'!$R:$U,3,FALSE),VLOOKUP(Scorekeeping!T11,'Standard Board Scores'!$R:$U,4,FALSE)),\"\")","v":""},{"$f":"IF(AND(U13<>\"\",$D$9=\"Horizontal\",$D$11=\"Yes\"),INDEX('Current Board'!$B$2:$P$16,VLOOKUP(Scorekeeping!U11,'Standard Board Scores'!$R:$U,3,FALSE),VLOOKUP(Scorekeeping!U11,'Standard Board Scores'!$R:$U,4,FALSE)),\"\")","v":""},{"$f":"IF(AND(V13<>\"\",$D$9=\"Horizontal\",$D$11=\"Yes\"),INDEX('Current Board'!$B$2:$P$16,VLOOKUP(Scorekeeping!V11,'Standard Board Scores'!$R:$U,3,FALSE),VLOOKUP(Scorekeeping!V11,'Standard Board Scores'!$R:$U,4,FALSE)),\"\")","v":""},{"$f":"IF(AND(W13<>\"\",$D$9=\"Horizontal\",$D$11=\"Yes\"),INDEX('Current Board'!$B$2:$P$16,VLOOKUP(Scorekeeping!W11,'Standard Board Scores'!$R:$U,3,FALSE),VLOOKUP(Scorekeeping!W11,'Standard Board Scores'!$R:$U,4,FALSE)),\"\")","v":""},{"$f":"IF(AND(X13<>\"\",$D$9=\"Horizontal\",$D$11=\"Yes\"),INDEX('Current Board'!$B$2:$P$16,VLOOKUP(Scorekeeping!X11,'Standard Board Scores'!$R:$U,3,FALSE),VLOOKUP(Scorekeeping!X11,'Standard Board Scores'!$R:$U,4,FALSE)),\"\")","v":""},{"$f":"IF(AND(Y13<>\"\",$D$9=\"Horizontal\",$D$11=\"Yes\"),INDEX('Current Board'!$B$2:$P$16,VLOOKUP(Scorekeeping!Y11,'Standard Board Scores'!$R:$U,3,FALSE),VLOOKUP(Scorekeeping!Y11,'Standard Board Scores'!$R:$U,4,FALSE)),\"\")","v":""}]
[null,null,null,null,null,null,null,null,null,null,{"$f":"IFERROR(VLOOKUP(K14,'Tiles Remaining'!$A:$C,3,FALSE),\"\")","v":""},{"$f":"IFERROR(VLOOKUP(L14,'Tiles Remaining'!$A:$C,3,FALSE),\"\")","v":""},{"$f":"IFERROR(VLOOKUP(M14,'Tiles Remaining'!$A:$C,3,FALSE),\"\")","v":""},{"$f":"IFERROR(VLOOKUP(N14,'Tiles Remaining'!$A:$C,3,FALSE),\"\")","v":""},{"$f":"IFERROR(VLOOKUP(O14,'Tiles Remaining'!$A:$C,3,FALSE),\"\")","v":""},{"$f":"IFERROR(VLOOKUP(P14,'Tiles Remaining'!$A:$C,3,FALSE),\"\")","v":""},{"$f":"IFERROR(VLOOKUP(Q14,'Tiles Remaining'!$A:$C,3,FALSE),\"\")","v":""},{"$f":"IFERROR(VLOOKUP(R14,'Tiles Remaining'!$A:$C,3,FALSE),\"\")","v":""},{"$f":"IFERROR(VLOOKUP(S14,'Tiles Remaining'!$A:$C,3,FALSE),\"\")","v":""},{"$f":"IFERROR(VLOOKUP(T14,'Tiles Remaining'!$A:$C,3,FALSE),\"\")","v":""},{"$f":"IFERROR(VLOOKUP(U14,'Tiles Remaining'!$A:$C,3,FALSE),\"\")","v":""},{"$f":"IFERROR(VLOOKUP(V14,'Tiles Remaining'!$A:$C,3,FALSE),\"\")","v":""},{"$f":"IFERROR(VLOOKUP(W14,'Tiles Remaining'!$A:$C,3,FALSE),\"\")","v":""},{"$f":"IFERROR(VLOOKUP(X14,'Tiles Remaining'!$A:$C,3,FALSE),\"\")","v":""},{"$f":"IFERROR(VLOOKUP(Y14,'Tiles Remaining'!$A:$C,3,FALSE),\"\")","v":""},{"$f":"SUM(K15:Y15)","v":0}]
[null,"Horizontal Left Side (for Vertical)",null,{"$f":"IFERROR(CONCATENATE(CHAR(CODE(LEFT(D2,1))-1),REPLACE(D2,1,1,\"\")),\"\")","v":""},"","","","","","",null,"Vertical 1 - Side A"]
[null,null,null,{"$f":"IF(IFERROR(IF(ISERROR(D$5),\"\",IF(OR($D$10=\"Vertical\",$D$10=\"Single Letter\"),INDEX('Current Board'!$B$2:$P$16,VLOOKUP(Scorekeeping!D16,'Standard Board Scores'!$R:$U,3,FALSE),VLOOKUP(Scorekeeping!D16,'Standard Board Scores'!$R:$U,4,FALSE)),\"\")),\"\")=0,\"\",IFERROR(IF(ISERROR(D$5),\"\",IF(OR($D$10=\"Vertical\",$D$10=\"Single Letter\"),INDEX('Current Board'!$B$2:$P$16,VLOOKUP(Scorekeeping!D16,'Standard Board Scores'!$R:$U,3,FALSE),VLOOKUP(Scorekeeping!D16,'Standard Board Scores'!$R:$U,4,FALSE)),\"\")),\"\"))","v":""},{"$f":"IF(IFERROR(IF(ISERROR(E$5),\"\",IF(OR($D$10=\"Vertical\",$D$10=\"Single Letter\"),INDEX('Current Board'!$B$2:$P$16,VLOOKUP(Scorekeeping!E16,'Standard Board Scores'!$R:$U,3,FALSE),VLOOKUP(Scorekeeping!E16,'Standard Board Scores'!$R:$U,4,FALSE)),\"\")),\"\")=0,\"\",IFERROR(IF(ISERROR(E$5),\"\",IF(OR($D$10=\"Vertical\",$D$10=\"Single Letter\"),INDEX('Current Board'!$B$2:$P$16,VLOOKUP(Scorekeeping!E16,'Standard Board Scores'!$R:$U,3,FALSE),VLOOKUP(Scorekeeping!E16,'Standard Board Scores'!$R:$U,4,FALSE)),\"\")),\"\"))","v":""},{"$f":"IF(IFERROR(IF(ISERROR(F$5),\"\",IF(OR($D$10=\"Vertical\",$D$10=\"Single Letter\"),INDEX('Current Board'!$B$2:$P$16,VLOOKUP(Scorekeeping!F16,'Standard Board Scores'!$R:$U,3,FALSE),VLOOKUP(Scorekeeping!F16,'Standard Board Scores'!$R:$U,4,FALSE)),\"\")),\"\")=0,\"\",IFERROR(IF(ISERROR(F$5),\"\",IF(OR($D$10=\"Vertical\",$D$10=\"Single Letter\"),INDEX('Current Board'!$B$2:$P$16,VLOOKUP(Scorekeeping!F16,'Standard Board Scores'!$R:$U,3,FALSE),VLOOKUP(Scorekeeping!F16,'Standard Board Scores'!$R:$U,4,FALSE)),\"\")),\"\"))","v":""},{"$f":"IF(IFERROR(IF(ISERROR(G$5),\"\",IF(OR($D$10=\"Vertical\",$D$10=\"Single Letter\"),INDEX('Current Board'!$B$2:$P$16,VLOOKUP(Scorekeeping!G16,'Standard Board Scores'!$R:$U,3,FALSE),VLOOKUP(Scorekeeping!G16,'Standard Board Scores'!$R:$U,4,FALSE)),\"\")),\"\")=0,\"\",IFERROR(IF(ISERROR(G$5),\"\",IF(OR($D$10=\"Vertical\",$D$10=\"Single Letter\"),INDEX('Current Board'!$B$2:$P$16,VLOOKUP(Scorekeeping!G16,'Standard Board Scores'!$R:$U,3,FALSE),VLOOKUP(Scorekeeping!G16,'Standard Board Scores'!$R:$U,4,FALSE)),\"\")),\"\"))","v":""},{"$f":"IF(IFERROR(IF(ISERROR(H$5),\"\",IF(OR($D$10=\"Vertical\",$D$10=\"Single Letter\"),INDEX('Current Board'!$B$2:$P$16,VLOOKUP(Scorekeeping!H16,'Standard Board Scores'!$R:$U,3,FALSE),VLOOKUP(Scorekeeping!H16,'Standard Board Scores'!$R:$U,4,FALSE)),\"\")),\"\")=0,\"\",IFERROR(IF(ISERROR(H$5),\"\",IF(OR($D$10=\"Vertical\",$D$10=\"Single Letter\"),INDEX('Current Board'!$B$2:$P$16,VLOOKUP(Scorekeeping!H16,'Standard Board Scores'!$R:$U,3,FALSE),VLOOKUP(Scorekeeping!H16,'Standard Board Scores'!$R:$U,4,FALSE)),\"\")),\"\"))","v":""},{"$f":"IF(IFERROR(IF(ISERROR(I$5),\"\",IF(OR($D$10=\"Vertical\",$D$10=\"Single Letter\"),INDEX('Current Board'!$B$2:$P$16,VLOOKUP(Scorekeeping!I16,'Standard Board Scores'!$R:$U,3,FALSE),VLOOKUP(Scorekeeping!I16,'Standard Board Scores'!$R:$U,4,FALSE)),\"\")),\"\")=0,\"\",IFERROR(IF(ISERROR(I$5),\"\",IF(OR($D$10=\"Vertical\",$D$10=\"Single Letter\"),INDEX('Current Board'!$B$2:$P$16,VLOOKUP(Scorekeeping!I16,'Standard Board Scores'!$R:$U,3,FALSE),VLOOKUP(Scorekeeping!I16,'Standard Board Scores'!$R:$U,4,FALSE)),\"\")),\"\"))","v":""},{"$f":"IF(IFERROR(IF(ISERROR(J$5),\"\",IF(OR($D$10=\"Vertical\",$D$10=\"Single Letter\"),INDEX('Current Board'!$B$2:$P$16,VLOOKUP(Scorekeeping!J16,'Standard Board Scores'!$R:$U,3,FALSE),VLOOKUP(Scorekeeping!J16,'Standard Board Scores'!$R:$U,4,FALSE)),\"\")),\"\")=0,\"\",IFERROR(IF(ISERROR(J$5),\"\",IF(OR($D$10=\"Vertical\",$D$10=\"Single Letter\"),INDEX('Current Board'!$B$2:$P$16,VLOOKUP(Scorekeeping!J16,'Standard Board Scores'!$R:$U,3,FALSE),VLOOKUP(Scorekeeping!J16,'Standard Board Scores'!$R:$U,4,FALSE)),\"\")),\"\"))","v":""},null,1,2,3,4,5,6,7,8,9,10,11,12,13,14]
[null,"Horizontal Right Side (for Vertical)",null,{"$f":"IFERROR(CONCATENATE(CHAR(CODE(LEFT(D2,1))+1),REPLACE(D2,1,1,\"\")),\"\")","v":""},"","","","","","",{"$f":"D16","v":""},{"$f":"IF(AND(K18<>\"\",LEFT(K18,1)<>\"B\",LEFT(K18,1)<>\"A\"),CONCATENATE(CHAR(CODE(LEFT(K18,1))-1),REPLACE(K18,1,1,\"\")),\"\")","v":""},{"$f":"IF(AND(L18<>\"\",LEFT(L18,1)<>\"B\",LEFT(L18,1)<>\"A\"),CONCATENATE(CHAR(CODE(LEFT(L18,1))-1),REPLACE(L18,1,1,\"\")),\"\")","v":""},"","","","","","","","","","","",""]
[null,null,null,{"$f":"IF(IFERROR(IF(ISERROR(D$5),\"\",IF(OR($D$10=\"Vertical\",$D$10=\"Single Letter\"),INDEX('Current Board'!$B$2:$P$16,VLOOKUP(Scorekeeping!D18,'Standard Board Scores'!$R:$U,3,FALSE),VLOOKUP(Scorekeeping!D18,'Standard Board Scores'!$R:$U,4,FALSE)),\"\")),\"\")=0,\"\",IFERROR(IF(ISERROR(D$5),\"\",IF(OR($D$10=\"Vertical\",$D$10=\"Single Letter\"),INDEX('Current Board'!$B$2:$P$16,VLOOKUP(Scorekeeping!D18,'Standard Board Scores'!$R:$U,3,FALSE),VLOOKUP(Scorekeeping!D18,'Standard Board Scores'!$R:$U,4,FALSE)),\"\")),\"\"))","v":""},{"$f":"IF(IFERROR(IF(ISERROR(E$5),\"\",IF(OR($D$10=\"Vertical\",$D$10=\"Single Letter\"),INDEX('Current Board'!$B$2:$P$16,VLOOKUP(Scorekeeping!E18,'Standard Board Scores'!$R:$U,3,FALSE),VLOOKUP(Scorekeeping!E18,'Standard Board Scores'!$R:$U,4,FALSE)),\"\")),\"\")=0,\"\",IFERROR(IF(ISERROR(E$5),\"\",IF(OR($D$10=\"Vertical\",$D$10=\"Single Letter\"),INDEX('Current Board'!$B$2:$P$16,VLOOKUP(Scorekeeping!E18,'Standard Board Scores'!$R:$U,3,FALSE),VLOOKUP(Scorekeeping!E18,'Standard Board Scores'!$R:$U,4,FALSE)),\"\")),\"\"))","v":""},{"$f":"IF(IFERROR(IF(ISERROR(F$5),\"\",IF(OR($D$10=\"Vertical\",$D$10=\"Single Letter\"),INDEX('Current Board'!$B$2:$P$16,VLOOKUP(Scorekeeping!F18,'Standard Board Scores'!$R:$U,3,FALSE),VLOOKUP(Scorekeeping!F18,'Standard Board Scores'!$R:$U,4,FALSE)),\"\")),\"\")=0,\"\",IFERROR(IF(ISERROR(F$5),\"\",IF(OR($D$10=\"Vertical\",$D$10=\"Single Letter\"),INDEX('Current Board'!$B$2:$P$16,VLOOKUP(Scorekeeping!F18,'Standard Board Scores'!$R:$U,3,FALSE),VLOOKUP(Scorekeeping!F18,'Standard Board Scores'!$R:$U,4,FALSE)),\"\")),\"\"))","v":""},{"$f":"IF(IFERROR(IF(ISERROR(G$5),\"\",IF(OR($D$10=\"Vertical\",$D$10=\"Single Letter\"),INDEX('Current Board'!$B$2:$P$16,VLOOKUP(Scorekeeping!G18,'Standard Board Scores'!$R:$U,3,FALSE),VLOOKUP(Scorekeeping!G18,'Standard Board Scores'!$R:$U,4,FALSE)),\"\")),\"\")=0,\"\",IFERROR(IF(ISERROR(G$5),\"\",IF(OR($D$10=\"Vertical\",$D$10=\"Single Letter\"),INDEX('Current Board'!$B$2:$P$16,VLOOKUP(Scorekeeping!G18,'Standard Board Scores'!$R:$U,3,FALSE),VLOOKUP(Scorekeeping!G18,'Standard Board Scores'!$R:$U,4,FALSE)),\"\")),\"\"))","v":""},{"$f":"IF(IFERROR(IF(ISERROR(H$5),\"\",IF(OR($D$10=\"Vertical\",$D$10=\"Single Letter\"),INDEX('Current Board'!$B$2:$P$16,VLOOKUP(Scorekeeping!H18,'Standard Board Scores'!$R:$U,3,FALSE),VLOOKUP(Scorekeeping!H18,'Standard Board Scores'!$R:$U,4,FALSE)),\"\")),\"\")=0,\"\",IFERROR(IF(ISERROR(H$5),\"\",IF(OR($D$10=\"Vertical\",$D$10=\"Single Letter\"),INDEX('Current Board'!$B$2:$P$16,VLOOKUP(Scorekeeping!H18,'Standard Board Scores'!$R:$U,3,FALSE),VLOOKUP(Scorekeeping!H18,'Standard Board Scores'!$R:$U,4,FALSE)),\"\")),\"\"))","v":""},{"$f":"IF(IFERROR(IF(ISERROR(I$5),\"\",IF(OR($D$10=\"Vertical\",$D$10=\"Single Letter\"),INDEX('Current Board'!$B$2:$P$16,VLOOKUP(Scorekeeping!I18,'Standard Board Scores'!$R:$U,3,FALSE),VLOOKUP(Scorekeeping!I18,'Standard Board Scores'!$R:$U,4,FALSE)),\"\")),\"\")=0,\"\",IFERROR(IF(ISERROR(I$5),\"\",IF(OR($D$10=\"Vertical\",$D$10=\"Single Letter\"),INDEX('Current Board'!$B$2:$P$16,VLOOKUP(Scorekeeping!I18,'Standard Board Scores'!$R:$U,3,FALSE),VLOOKUP(Scorekeeping!I18,'Standard Board Scores'!$R:$U,4,FALSE)),\"\")),\"\"))","v":""},{"$f":"IF(IFERROR(IF(ISERROR(J$5),\"\",IF(OR($D$10=\"Vertical\",$D$10=\"Single Letter\"),INDEX('Current Board'!$B$2:$P$16,VLOOKUP(Scorekeeping!J18,'Standard Board Scores'!$R:$U,3,FALSE),VLOOKUP(Scorekeeping!J18,'Standard Board Scores'!$R:$U,4,FALSE)),\"\")),\"\")=0,\"\",IFERROR(IF(ISERROR(J$5),\"\",IF(OR($D$10=\"Vertical\",$D$10=\"Single Letter\"),INDEX('Current Board'!$B$2:$P$16,VLOOKUP(Scorekeeping!J18,'Standard Board Scores'!$R:$U,3,FALSE),VLOOKUP(Scorekeeping!J18,'Standard Board Scores'!$R:$U,4,FALSE)),\"\")),\"\"))","v":""},{"$f":"IF(IFERROR(IF(K18=\"\",\"\",IF(OR($D$9=\"Vertical\",$D$9=\"Single Letter\"),INDEX('Current Board'!$B$2:$P$16,VLOOKUP(Scorekeeping!K18,'Standard Board Scores'!$R:$U,3,FALSE),VLOOKUP(Scorekeeping!K18,'Standard Board Scores'!$R:$U,4,FALSE)),\"\")),\"\")=0,\"\",IFERROR(IF(ISERROR(K18),\"\",IF(OR($D$9=\"Vertical\",$D$9=\"Single Letter\"),INDEX('Current Board'!$B$2:$P$16,VLOOKUP(Scorekeeping!K18,'Standard Board Scores'!$R:$U,3,FALSE),VLOOKUP(Scorekeeping!K18,'Standard Board Scores'!$R:$U,4,FALSE)),\"\")),\"\"))","v":""},{"$f":"IF(K19<>\"\",IF(IFERROR(IF(L18=\"\",\"\",IF(OR($D$9=\"Vertical\",$D$9=\"Single Letter\"),INDEX('Current Board'!$B$2:$P$16,VLOOKUP(Scorekeeping!L18,'Standard Board Scores'!$R:$U,3,FALSE),VLOOKUP(Scorekeeping!L18,'Standard Board Scores'!$R:$U,4,FALSE)),\"\")),\"\")=0,\"\",IFERROR(IF(ISERROR(L18),\"\",IF(OR($D$9=\"Vertical\",$D$9=\"Single Letter\"),INDEX('Current Board'!$B$2:$P$16,VLOOKUP(Scorekeeping!L18,'Standard Board Scores'!$R:$U,3,FALSE),VLOOKUP(Scorekeeping!L18,'Standard Board Scores'!$R:$U,4,FALSE)),\"\")),\"\")),\"\")","v":""},{"$f":"IF(L19<>\"\",IF(IFERROR(IF(M18=\"\",\"\",IF(OR($D$9=\"Vertical\",$D$9=\"Single Letter\"),INDEX('Current Board'!$B$2:$P$16,VLOOKUP(Scorekeeping!M18,'Standard Board Scores'!$R:$U,3,FALSE),VLOOKUP(Scorekeeping!M18,'Standard Board Scores'!$R:$U,4,FALSE)),\"\")),\"\")=0,\"\",IFERROR(IF(ISERROR(M18),\"\",IF(OR($D$9=\"Vertical\",$D$9=\"Single Letter\"),INDEX('Current Board'!$B$2:$P$16,VLOOKUP(Scorekeeping!M18,'Standard Board Scores'!$R:$U,3,FALSE),VLOOKUP(Scorekeeping!M18,'Standard Board Scores'!$R:$U,4,FALSE)),\"\")),\"\")),\"\")","v":""},{"$f":"IF(M19<>\"\",IF(IFERROR(IF(N18=\"\",\"\",IF(OR($D$9=\"Vertical\",$D$9=\"Single Letter\"),INDEX('Current Board'!$B$2:$P$16,VLOOKUP(Scorekeeping!N18,'Standard Board Scores'!$R:$U,3,FALSE),VLOOKUP(Scorekeeping!N18,'Standard Board Scores'!$R:$U,4,FALSE)),\"\")),\"\")=0,\"\",IFERROR(IF(ISERROR(N18),\"\",IF(OR($D$9=\"Vertical\",$D$9=\"Single Letter\"),INDEX('Current Board'!$B$2:$P$16,VLOOKUP(Scorekeeping!N18,'Standard Board Scores'!$R:$U,3,FALSE),VLOOKUP(Scorekeeping!N18,'Standard Board Scores'!$R:$U,4,FALSE)),\"\")),\"\")),\"\")","v":""},{"$f":"IF(N19<>\"\",IF(IFERROR(IF(O18=\"\",\"\",IF(OR($D$9=\"Vertical\",$D$9=\"Single Letter\"),INDEX('Current Board'!$B$2:$P$16,VLOOKUP(Scorekeeping!O18,'Standard Board Scores'!$R:$U,3,FALSE),VLOOKUP(Scorekeeping!O18,'Standard Board Scores'!$R:$U,4,FALSE)),\"\")),\"\")=0,\"\",IFERROR(IF(ISERROR(O18),\"\",IF(OR($D$9=\"Vertical\",$D$9=\"Single Letter\"),INDEX('Current Board'!$B$2:$P$16,VLOOKUP(Scorekeeping!O18,'Standard Board Scores'!$R:$U,3,FALSE),VLOOKUP(Scorekeeping!O18,'Standard Board Scores'!$R:$U,4,FALSE)),\"\")),\"\")),\"\")","v":""},{"$f":"IF(O19<>\"\",IF(IFERROR(IF(P18=\"\",\"\",IF(OR($D$9=\"Vertical\",$D$9=\"Single Letter\"),INDEX('Current Board'!$B$2:$P$16,VLOOKUP(Scorekeeping!P18,'Standard Board Scores'!$R:$U,3,FALSE),VLOOKUP(Scorekeeping!P18,'Standard Board Scores'!$R:$U,4,FALSE)),\"\")),\"\")=0,\"\",IFERROR(IF(ISERROR(P18),\"\",IF(OR($D$9=\"Vertical\",$D$9=\"Single Letter\"),INDEX('Current Board'!$B$2:$P$16,VLOOKUP(Scorekeeping!P18,'Standard Board Scores'!$R:$U,3,FALSE),VLOOKUP(Scorekeeping!P18,'Standard Board Scores'!$R:$U,4,FALSE)),\"\")),\"\")),\"\")","v":""},{"$f":"IF(P19<>\"\",IF(IFERROR(IF(Q18=\"\",\"\",IF(OR($D$9=\"Vertical\",$D$9=\"Single Letter\"),INDEX('Current Board'!$B$2:$P$16,VLOOKUP(Scorekeeping!Q18,'Standard Board Scores'!$R:$U,3,FALSE),VLOOKUP(Scorekeeping!Q18,'Standard Board Scores'!$R:$U,4,FALSE)),\"\")),\"\")=0,\"\",IFERROR(IF(ISERROR(Q18),\"\",IF(OR($D$9=\"Vertical\",$D$9=\"Single Letter\"),INDEX('Current Board'!$B$2:$P$16,VLOOKUP(Scorekeeping!Q18,'Standard Board Scores'!$R:$U,3,FALSE),VLOOKUP(Scorekeeping!Q18,'Standard Board Scores'!$R:$U,4,FALSE)),\"\")),\"\")),\"\")","v":""},{"$f":"IF(Q19<>\"\",IF(IFERROR(IF(R18=\"\",\"\",IF(OR($D$9=\"Vertical\",$D$9=\"Single Letter\"),INDEX('Current Board'!$B$2:$P$16,VLOOKUP(Scorekeeping!R18,'Standard Board Scores'!$R:$U,3,FALSE),VLOOKUP(Scorekeeping!R18,'Standard Board Scores'!$R:$U,4,FALSE)),\"\")),\"\")=0,\"\",IFERROR(IF(ISERROR(R18),\"\",IF(OR($D$9=\"Vertical\",$D$9=\"Single Letter\"),INDEX('Current Board'!$B$2:$P$16,VLOOKUP(Scorekeeping!R18,'Standard Board Scores'!$R:$U,3,FALSE),VLOOKUP(Scorekeeping!R18,'Standard Board Scores'!$R:$U,4,FALSE)),\"\")),\"\")),\"\")","v":""},{"$f":"IF(R19<>\"\",IF(IFERROR(IF(S18=\"\",\"\",IF(OR($D$9=\"Vertical\",$D$9=\"Single Letter\"),INDEX('Current Board'!$B$2:$P$16,VLOOKUP(Scorekeeping!S18,'Standard Board Scores'!$R:$U,3,FALSE),VLOOKUP(Scorekeeping!S18,'Standard Board Scores'!$R:$U,4,FALSE)),\"\")),\"\")=0,\"\",IFERROR(IF(ISERROR(S18),\"\",IF(OR($D$9=\"Vertical\",$D$9=\"Single Letter\"),INDEX('Current Board'!$B$2:$P$16,VLOOKUP(Scorekeeping!S18,'Standard Board Scores'!$R:$U,3,FALSE),VLOOKUP(Scorekeeping!S18,'Standard Board Scores'!$R:$U,4,FALSE)),\"\")),\"\")),\"\")","v":""},{"$f":"IF(S19<>\"\",IF(IFERROR(IF(T18=\"\",\"\",IF(OR($D$9=\"Vertical\",$D$9=\"Single Letter\"),INDEX('Current Board'!$B$2:$P$16,VLOOKUP(Scorekeeping!T18,'Standard Board Scores'!$R:$U,3,FALSE),VLOOKUP(Scorekeeping!T18,'Standard Board Scores'!$R:$U,4,FALSE)),\"\")),\"\")=0,\"\",IFERROR(IF(ISERROR(T18),\"\",IF(OR($D$9=\"Vertical\",$D$9=\"Single Letter\"),INDEX('Current Board'!$B$2:$P$16,VLOOKUP(Scorekeeping!T18,'Standard Board Scores'!$R:$U,3,FALSE),VLOOKUP(Scorekeeping!T18,'Standard Board Scores'!$R:$U,4,FALSE)),\"\")),\"\")),\"\")","v":""},{"$f":"IF(T19<>\"\",IF(IFERROR(IF(U18=\"\",\"\",IF(OR($D$9=\"Vertical\",$D$9=\"Single Letter\"),INDEX('Current Board'!$B$2:$P$16,VLOOKUP(Scorekeeping!U18,'Standard Board Scores'!$R:$U,3,FALSE),VLOOKUP(Scorekeeping!U18,'Standard Board Scores'!$R:$U,4,FALSE)),\"\")),\"\")=0,\"\",IFERROR(IF(ISERROR(U18),\"\",IF(OR($D$9=\"Vertical\",$D$9=\"Single Letter\"),INDEX('Current Board'!$B$2:$P$16,VLOOKUP(Scorekeeping!U18,'Standard Board Scores'!$R:$U,3,FALSE),VLOOKUP(Scorekeeping!U18,'Standard Board Scores'!$R:$U,4,FALSE)),\"\")),\"\")),\"\")","v":""},{"$f":"IF(U19<>\"\",IF(IFERROR(IF(V18=\"\",\"\",IF(OR($D$9=\"Vertical\",$D$9=\"Single Letter\"),INDEX('Current Board'!$B$2:$P$16,VLOOKUP(Scorekeeping!V18,'Standard Board Scores'!$R:$U,3,FALSE),VLOOKUP(Scorekeeping!V18,'Standard Board Scores'!$R:$U,4,FALSE)),\"\")),\"\")=0,\"\",IFERROR(IF(ISERROR(V18),\"\",IF(OR($D$9=\"Vertical\",$D$9=\"Single Letter\"),INDEX('Current Board'!$B$2:$P$16,VLOOKUP(Scorekeeping!V18,'Standard Board Scores'!$R:$U,3,FALSE),VLOOKUP(Scorekeeping!V18,'Standard Board Scores'!$R:$U,4,FALSE)),\"\")),\"\")),\"\")","v":""},{"$f":"IF(V19<>\"\",IF(IFERROR(IF(W18=\"\",\"\",IF(OR($D$9=\"Vertical\",$D$9=\"Single Letter\"),INDEX('Current Board'!$B$2:$P$16,VLOOKUP(Scorekeeping!W18,'Standard Board Scores'!$R:$U,3,FALSE),VLOOKUP(Scorekeeping!W18,'Standard Board Scores'!$R:$U,4,FALSE)),\"\")),\"\")=0,\"\",IFERROR(IF(ISERROR(W18),\"\",IF(OR($D$9=\"Vertical\",$D$9=\"Single Letter\"),INDEX('Current Board'!$B$2:$P$16,VLOOKUP(Scorekeeping!W18,'Standard Board Scores'!$R:$U,3,FALSE),VLOOKUP(Scorekeeping!W18,'Standard Board Scores'!$R:$U,4,FALSE)),\"\")),\"\")),\"\")","v":""},{"$f":"IF(W19<>\"\",IF(IFERROR(IF(X18=\"\",\"\",IF(OR($D$9=\"Vertical\",$D$9=\"Single Letter\"),INDEX('Current Board'!$B$2:$P$16,VLOOKUP(Scorekeeping!X18,'Standard Board Scores'!$R:$U,3,FALSE),VLOOKUP(Scorekeeping!X18,'Standard Board Scores'!$R:$U,4,FALSE)),\"\")),\"\")=0,\"\",IFERROR(IF(ISERROR(X18),\"\",IF(OR($D$9=\"Vertical\",$D$9=\"Single Letter\"),INDEX('Current Board'!$B$2:$P$16,VLOOKUP(Scorekeeping!X18,'Standard Board Scores'!$R:$U,3,FALSE),VLOOKUP(Scorekeeping!X18,'Standard Board Scores'!$R:$U,4,FALSE)),\"\")),\"\")),\"\")","v":""},{"$f":"IF(X19<>\"\",IF(IFERROR(IF(Y18=\"\",\"\",IF(OR($D$9=\"Vertical\",$D$9=\"Single Letter\"),INDEX('Current Board'!$B$2:$P$16,VLOOKUP(Scorekeeping!Y18,'Standard Board Scores'!$R:$U,3,FALSE),VLOOKUP(Scorekeeping!Y18,'Standard Board Scores'!$R:$U,4,FALSE)),\"\")),\"\")=0,\"\",IFERROR(IF(ISERROR(Y18),\"\",IF(OR($D$9=\"Vertical\",$D$9=\"Single Letter\"),INDEX('Current Board'!$B$2:$P$16,VLOOKUP(Scorekeeping!Y18,'Standard Board Scores'!$R:$U,3,FALSE),VLOOKUP(Scorekeeping!Y18,'Standard Board Scores'!$R:$U,4,FALSE)),\"\")),\"\")),\"\")","v":""}]
[null,"Double-Count - Secondary Word (for Vertical)",null,{"$f":"IF(OR(D17<>\"\",D19<>\"\"),\"Yes\",\"No\")","v":"No"},{"$f":"IF(OR(E17<>\"\",E19<>\"\"),\"Yes\",\"No\")","v":"No"},"No","No","No","No","No",{"$f":"IFERROR(VLOOKUP(K19,'Tiles Remaining'!$A:$C,3,FALSE),\"\")","v":""},{"$f":"IFERROR(VLOOKUP(L19,'Tiles Remaining'!$A:$C,3,FALSE),\"\")","v":""},{"$f":"IFERROR(VLOOKUP(M19,'Tiles Remaining'!$A:$C,3,FALSE),\"\")","v":""},{"$f":"IFERROR(VLOOKUP(N19,'Tiles Remaining'!$A:$C,3,FALSE),\"\")","v":""},{"$f":"IFERROR(VLOOKUP(O19,'Tiles Remaining'!$A:$C,3,FALSE),\"\")","v":""},{"$f":"IFERROR(VLOOKUP(P19,'Tiles Remaining'!$A:$C,3,FALSE),\"\")","v":""},{"$f":"IFERROR(VLOOKUP(Q19,'Tiles Remaining'!$A:$C,3,FALSE),\"\")","v":""},{"$f":"IFERROR(VLOOKUP(R19,'Tiles Remaining'!$A:$C,3,FALSE),\"\")","v":""},{"$f":"IFERROR(VLOOKUP(S19,'Tiles Remaining'!$A:$C,3,FALSE),\"\")","v":""},{"$f":"IFERROR(VLOOKUP(T19,'Tiles Remaining'!$A:$C,3,FALSE),\"\")","v":""},{"$f":"IFERROR(VLOOKUP(U19,'Tiles Remaining'!$A:$C,3,FALSE),\"\")","v":""},{"$f":"IFERROR(VLOOKUP(V19,'Tiles Remaining'!$A:$C,3,FALSE),\"\")","v":""},{"$f":"IFERROR(VLOOKUP(W19,'Tiles Remaining'!$A:$C,3,FALSE),\"\")","v":""},{"$f":"IFERROR(VLOOKUP(X19,'Tiles Remaining'!$A:$C,3,FALSE),\"\")","v":""},{"$f":"IFERROR(VLOOKUP(Y19,'Tiles Remaining'!$A:$C,3,FALSE),\"\")","v":""},{"$f":"SUM(K20:Y20)","v":0}]
[null,null,null,{"$f":"IF(D20=\"Yes\",D$5,0)","v":0},0,0,0,0,0,0,null,"Vertical 2 - Side A"]
[null,"Top (for Vertical)",null,{"$f":"IFERROR(CONCATENATE(LEFT(D2),VALUE(REPLACE(D2,1,1,\"\"))-1),\"\")","v":""},{"$f":"\"\"","v":""},{"$f":"\"\"","v":""},{"$f":"\"\"","v":""},{"$f":"\"\"","v":""},{"$f":"\"\"","v":""},{"$f":"\"\"","v":""},null,1,2,3,4,5,6,7,8,9,10,11,12,13,14]
[null,null,null,{"$f":"IF(IFERROR(IF(ISERROR(D$5),\"\",IF(OR($D$10=\"Vertical\",$D$10=\"Single Letter\"),INDEX('Current Board'!$B$2:$P$16,VLOOKUP(Scorekeeping!D22,'Standard Board Scores'!$R:$U,3,FALSE),VLOOKUP(Scorekeeping!D22,'Standard Board Scores'!$R:$U,4,FALSE)),\"\")),\"\")=0,\"\",IFERROR(IF(ISERROR(D$5),\"\",IF(OR($D$10=\"Vertical\",$D$10=\"Single Letter\"),INDEX('Current Board'!$B$2:$P$16,VLOOKUP(Scorekeeping!D22,'Standard Board Scores'!$R:$U,3,FALSE),VLOOKUP(Scorekeeping!D22,'Standard Board Scores'!$R:$U,4,FALSE)),\"\")),\"\"))","v":""},{"$f":"IF(IFERROR(IF(ISERROR(E$5),\"\",IF(OR($D$10=\"Vertical\",$D$10=\"Single Letter\"),INDEX('Current Board'!$B$2:$P$16,VLOOKUP(Scorekeeping!E22,'Standard Board Scores'!$R:$U,3,FALSE),VLOOKUP(Scorekeeping!E22,'Standard Board Scores'!$R:$U,4,FALSE)),\"\")),\"\")=0,\"\",IFERROR(IF(ISERROR(E$5),\"\",IF(OR($D$10=\"Vertical\",$D$10=\"Single Letter\"),INDEX('Current Board'!$B$2:$P$16,VLOOKUP(Scorekeeping!E22,'Standard Board Scores'!$R:$U,3,FALSE),VLOOKUP(Scorekeeping!E22,'Standard Board Scores'!$R:$U,4,FALSE)),\"\")),\"\"))","v":""},{"$f":"IF(IFERROR(IF(ISERROR(F$5),\"\",IF(OR($D$10=\"Vertical\",$D$10=\"Single Letter\"),INDEX('Current Board'!$B$2:$P$16,VLOOKUP(Scorekeeping!F22,'Standard Board Scores'!$R:$U,3,FALSE),VLOOKUP(Scorekeeping!F22,'Standard Board Scores'!$R:$U,4,FALSE)),\"\")),\"\")=0,\"\",IFERROR(IF(ISERROR(F$5),\"\",IF(OR($D$10=\"Vertical\",$D$10=\"Single Letter\"),INDEX('Current Board'!$B$2:$P$16,VLOOKUP(Scorekeeping!F22,'Standard Board Scores'!$R:$U,3,FALSE),VLOOKUP(Scorekeeping!F22,'Standard Board Scores'!$R:$U,4,FALSE)),\"\")),\"\"))","v":""},{"$f":"IF(IFERROR(IF(ISERROR(G$5),\"\",IF(OR($D$10=\"Vertical\",$D$10=\"Single Letter\"),INDEX('Current Board'!$B$2:$P$16,VLOOKUP(Scorekeeping!G22,'Standard Board Scores'!$R:$U,3,FALSE),VLOOKUP(Scorekeeping!G22,'Standard Board Scores'!$R:$U,4,FALSE)),\"\")),\"\")=0,\"\",IFERROR(IF(ISERROR(G$5),\"\",IF(OR($D$10=\"Vertical\",$D$10=\"Single Letter\"),INDEX('Current Board'!$B$2:$P$16,VLOOKUP(Scorekeeping!G22,'Standard Board Scores'!$R:$U,3,FALSE),VLOOKUP(Scorekeeping!G22,'Standard Board Scores'!$R:$U,4,FALSE)),\"\")),\"\"))","v":""},{"$f":"IF(IFERROR(IF(ISERROR(H$5),\"\",IF(OR($D$10=\"Vertical\",$D$10=\"Single Letter\"),INDEX('Current Board'!$B$2:$P$16,VLOOKUP(Scorekeeping!H22,'Standard Board Scores'!$R:$U,3,FALSE),VLOOKUP(Scorekeeping!H22,'Standard Board Scores'!$R:$U,4,FALSE)),\"\")),\"\")=0,\"\",IFERROR(IF(ISERROR(H$5),\"\",IF(OR($D$10=\"Vertical\",$D$10=\"Single Letter\"),INDEX('Current Board'!$B$2:$P$16,VLOOKUP(Scorekeeping!H22,'Standard Board Scores'!$R:$U,3,FALSE),VLOOKUP(Scorekeeping!H22,'Standard Board Scores'!$R:$U,4,FALSE)),\"\")),\"\"))","v":""},{"$f":"IF(IFERROR(IF(ISERROR(I$5),\"\",IF(OR($D$10=\"Vertical\",$D$10=\"Single Letter\"),INDEX('Current Board'!$B$2:$P$16,VLOOKUP(Scorekeeping!I22,'Standard Board Scores'!$R:$U,3,FALSE),VLOOKUP(Scorekeeping!I22,'Standard Board Scores'!$R:$U,4,FALSE)),\"\")),\"\")=0,\"\",IFERROR(IF(ISERROR(I$5),\"\",IF(OR($D$10=\"Vertical\",$D$10=\"Single Letter\"),INDEX('Current Board'!$B$2:$P$16,VLOOKUP(Scorekeeping!I22,'Standard Board Scores'!$R:$U,3,FALSE),VLOOKUP(Scorekeeping!I22,'Standard Board Scores'!$R:$U,4,FALSE)),\"\")),\"\"))","v":""},{"$f":"IF(IFERROR(IF(ISERROR(J$5),\"\",IF(OR($D$10=\"Vertical\",$D$10=\"Single Letter\"),INDEX('Current Board'!$B$2:$P$16,VLOOKUP(Scorekeeping!J22,'Standard Board Scores'!$R:$U,3,FALSE),VLOOKUP(Scorekeeping!J22,'Standard Board Scores'!$R:$U,4,FALSE)),\"\")),\"\")=0,\"\",IFERROR(IF(ISERROR(J$5),\"\",IF(OR($D$10=\"Vertical\",$D$10=\"Single Letter\"),INDEX('Current Board'!$B$2:$P$16,VLOOKUP(Scorekeeping!J22,'Standard Board Scores'!$R:$U,3,FALSE),VLOOKUP(Scorekeeping!J22,'Standard Board Scores'!$R:$U,4,FALSE)),\"\")),\"\"))","v":""},{"$f":"E16","v":""},{"$f":"IF(AND(K23<>\"\",LEFT(K23,1)<>\"B\",LEFT(K23,1)<>\"A\"),CONCATENATE(CHAR(CODE(LEFT(K23,1))-1),REPLACE(K23,1,1,\"\")),\"\")","v":""},{"$f":"IF(AND(L23<>\"\",LEFT(L23,1)<>\"B\",LEFT(L23,1)<>\"A\"),CONCATENATE(CHAR(CODE(LEFT(L23,1))-1),REPLACE(L23,1,1,\"\")),\"\")","v":""},"","","","","","","","","","","",""]
[null,"Bottom (for Vertical)",null,{"$f":"IF(E2=\"\",IFERROR(CONCATENATE(LEFT(D2),VALUE(REPLACE(D2,1,1,\"\"))+1),\"\"),\"\")","v":""},"","","","","",{"$f":"IF(K18=\"\",IFERROR(CONCATENATE(LEFT(J2),VALUE(REPLACE(J2,1,1,\"\"))+1),\"\"),\"\")","v":""},{"$f":"IF(IFERROR(IF(K23=\"\",\"\",IF(OR($D$9=\"Vertical\",$D$9=\"Single Letter\"),INDEX('Current Board'!$B$2:$P$16,VLOOKUP(Scorekeeping!K23,'Standard Board Scores'!$R:$U,3,FALSE),VLOOKUP(Scorekeeping!K23,'Standard Board Scores'!$R:$U,4,FALSE)),\"\")),\"\")=0,\"\",IFERROR(IF(ISERROR(K23),\"\",IF(OR($D$9=\"Vertical\",$D$9=\"Single Letter\"),INDEX('Current Board'!$B$2:$P$16,VLOOKUP(Scorekeeping!K23,'Standard Board Scores'!$R:$U,3,FALSE),VLOOKUP(Scorekeeping!K23,'Standard Board Scores'!$R:$U,4,FALSE)),\"\")),\"\"))","v":""},{"$f":"IF(K24<>\"\",IF(IFERROR(IF(L23=\"\",\"\",IF(OR($D$9=\"Vertical\",$D$9=\"Single Letter\"),INDEX('Current Board'!$B$2:$P$16,VLOOKUP(Scorekeeping!L23,'Standard Board Scores'!$R:$U,3,FALSE),VLOOKUP(Scorekeeping!L23,'Standard Board Scores'!$R:$U,4,FALSE)),\"\")),\"\")=0,\"\",IFERROR(IF(ISERROR(L23),\"\",IF(OR($D$9=\"Vertical\",$D$9=\"Single Letter\"),INDEX('Current Board'!$B$2:$P$16,VLOOKUP(Scorekeeping!L23,'Standard Board Scores'!$R:$U,3,FALSE),VLOOKUP(Scorekeeping!L23,'Standard Board Scores'!$R:$U,4,FALSE)),\"\")),\"\")),\"\")","v":""},{"$f":"IF(L24<>\"\",IF(IFERROR(IF(M23=\"\",\"\",IF(OR($D$9=\"Vertical\",$D$9=\"Single Letter\"),INDEX('Current Board'!$B$2:$P$16,VLOOKUP(Scorekeeping!M23,'Standard Board Scores'!$R:$U,3,FALSE),VLOOKUP(Scorekeeping!M23,'Standard Board Scores'!$R:$U,4,FALSE)),\"\")),\"\")=0,\"\",IFERROR(IF(ISERROR(M23),\"\",IF(OR($D$9=\"Vertical\",$D$9=\"Single Letter\"),INDEX('Current Board'!$B$2:$P$16,VLOOKUP(Scorekeeping!M23,'Standard Board Scores'!$R:$U,3,FALSE),VLOOKUP(Scorekeeping!M23,'Standard Board Scores'!$R:$U,4,FALSE)),\"\")),\"\")),\"\")","v":""},{"$f":"IF(M24<>\"\",IF(IFERROR(IF(N23=\"\",\"\",IF(OR($D$9=\"Vertical\",$D$9=\"Single Letter\"),INDEX('Current Board'!$B$2:$P$16,VLOOKUP(Scorekeeping!N23,'Standard Board Scores'!$R:$U,3,FALSE),VLOOKUP(Scorekeeping!N23,'Standard Board Scores'!$R:$U,4,FALSE)),\"\")),\"\")=0,\"\",IFERROR(IF(ISERROR(N23),\"\",IF(OR($D$9=\"Vertical\",$D$9=\"Single Letter\"),INDEX('Current Board'!$B$2:$P$16,VLOOKUP(Scorekeeping!N23,'Standard Board Scores'!$R:$U,3,FALSE),VLOOKUP(Scorekeeping!N23,'Standard Board Scores'!$R:$U,4,FALSE)),\"\")),\"\")),\"\")","v":""},{"$f":"IF(N24<>\"\",IF(IFERROR(IF(O23=\"\",\"\",IF(OR($D$9=\"Vertical\",$D$9=\"Single Letter\"),INDEX('Current Board'!$B$2:$P$16,VLOOKUP(Scorekeeping!O23,'Standard Board Scores'!$R:$U,3,FALSE),VLOOKUP(Scorekeeping!O23,'Standard Board Scores'!$R:$U,4,FALSE)),\"\")),\"\")=0,\"\",IFERROR(IF(ISERROR(O23),\"\",IF(OR($D$9=\"Vertical\",$D$9=\"Single Letter\"),INDEX('Current Board'!$B$2:$P$16,VLOOKUP(Scorekeeping!O23,'Standard Board Scores'!$R:$U,3,FALSE),VLOOKUP(Scorekeeping!O23,'Standard Board Scores'!$R:$U,4,FALSE)),\"\")),\"\")),\"\")","v":""},{"$f":"IF(O24<>\"\",IF(IFERROR(IF(P23=\"\",\"\",IF(OR($D$9=\"Vertical\",$D$9=\"Single Letter\"),INDEX('Current Board'!$B$2:$P$16,VLOOKUP(Scorekeeping!P23,'Standard Board Scores'!$R:$U,3,FALSE),VLOOKUP(Scorekeeping!P23,'Standard Board Scores'!$R:$U,4,FALSE)),\"\")),\"\")=0,\"\",IFERROR(IF(ISERROR(P23),\"\",IF(OR($D$9=\"Vertical\",$D$9=\"Single Letter\"),INDEX('Current Board'!$B$2:$P$16,VLOOKUP(Scorekeeping!P23,'Standard Board Scores'!$R:$U,3,FALSE),VLOOKUP(Scorekeeping!P23,'Standard Board Scores'!$R:$U,4,FALSE)),\"\")),\"\")),\"\")","v":""},{"$f":"IF(P24<>\"\",IF(IFERROR(IF(Q23=\"\",\"\",IF(OR($D$9=\"Vertical\",$D$9=\"Single Letter\"),INDEX('Current Board'!$B$2:$P$16,VLOOKUP(Scorekeeping!Q23,'Standard Board Scores'!$R:$U,3,FALSE),VLOOKUP(Scorekeeping!Q23,'Standard Board Scores'!$R:$U,4,FALSE)),\"\")),\"\")=0,\"\",IFERROR(IF(ISERROR(Q23),\"\",IF(OR($D$9=\"Vertical\",$D$9=\"Single Letter\"),INDEX('Current Board'!$B$2:$P$16,VLOOKUP(Scorekeeping!Q23,'Standard Board Scores'!$R:$U,3,FALSE),VLOOKUP(Scorekeeping!Q23,'Standard Board Scores'!$R:$U,4,FALSE)),\"\")),\"\")),\"\")","v":""},{"$f":"IF(Q24<>\"\",IF(IFERROR(IF(R23=\"\",\"\",IF(OR($D$9=\"Vertical\",$D$9=\"Single Letter\"),INDEX('Current Board'!$B$2:$P$16,VLOOKUP(Scorekeeping!R23,'Standard Board Scores'!$R:$U,3,FALSE),VLOOKUP(Scorekeeping!R23,'Standard Board Scores'!$R:$U,4,FALSE)),\"\")),\"\")=0,\"\",IFERROR(IF(ISERROR(R23),\"\",IF(OR($D$9=\"Vertical\",$D$9=\"Single Letter\"),INDEX('Current Board'!$B$2:$P$16,VLOOKUP(Scorekeeping!R23,'Standard Board Scores'!$R:$U,3,FALSE),VLOOKUP(Scorekeeping!R23,'Standard Board Scores'!$R:$U,4,FALSE)),\"\")),\"\")),\"\")","v":""},{"$f":"IF(R24<>\"\",IF(IFERROR(IF(S23=\"\",\"\",IF(OR($D$9=\"Vertical\",$D$9=\"Single Letter\"),INDEX('Current Board'!$B$2:$P$16,VLOOKUP(Scorekeeping!S23,'Standard Board Scores'!$R:$U,3,FALSE),VLOOKUP(Scorekeeping!S23,'Standard Board Scores'!$R:$U,4,FALSE)),\"\")),\"\")=0,\"\",IFERROR(IF(ISERROR(S23),\"\",IF(OR($D$9=\"Vertical\",$D$9=\"Single Letter\"),INDEX('Current Board'!$B$2:$P$16,VLOOKUP(Scorekeeping!S23,'Standard Board Scores'!$R:$U,3,FALSE),VLOOKUP(Scorekeeping!S23,'Standard Board Scores'!$R:$U,4,FALSE)),\"\")),\"\")),\"\")","v":""},{"$f":"IF(S24<>\"\",IF(IFERROR(IF(T23=\"\",\"\",IF(OR($D$9=\"Vertical\",$D$9=\"Single Letter\"),INDEX('Current Board'!$B$2:$P$16,VLOOKUP(Scorekeeping!T23,'Standard Board Scores'!$R:$U,3,FALSE),VLOOKUP(Scorekeeping!T23,'Standard Board Scores'!$R:$U,4,FALSE)),\"\")),\"\")=0,\"\",IFERROR(IF(ISERROR(T23),\"\",IF(OR($D$9=\"Vertical\",$D$9=\"Single Letter\"),INDEX('Current Board'!$B$2:$P$16,VLOOKUP(Scorekeeping!T23,'Standard Board Scores'!$R:$U,3,FALSE),VLOOKUP(Scorekeeping!T23,'Standard Board Scores'!$R:$U,4,FALSE)),\"\")),\"\")),\"\")","v":""},{"$f":"IF(T24<>\"\",IF(IFERROR(IF(U23=\"\",\"\",IF(OR($D$9=\"Vertical\",$D$9=\"Single Letter\"),INDEX('Current Board'!$B$2:$P$16,VLOOKUP(Scorekeeping!U23,'Standard Board Scores'!$R:$U,3,FALSE),VLOOKUP(Scorekeeping!U23,'Standard Board Scores'!$R:$U,4,FALSE)),\"\")),\"\")=0,\"\",IFERROR(IF(ISERROR(U23),\"\",IF(OR($D$9=\"Vertical\",$D$9=\"Single Letter\"),INDEX('Current Board'!$B$2:$P$16,VLOOKUP(Scorekeeping!U23,'Standard Board Scores'!$R:$U,3,FALSE),VLOOKUP(Scorekeeping!U23,'Standard Board Scores'!$R:$U,4,FALSE)),\"\")),\"\")),\"\")","v":""},{"$f":"IF(U24<>\"\",IF(IFERROR(IF(V23=\"\",\"\",IF(OR($D$9=\"Vertical\",$D$9=\"Single Letter\"),INDEX('Current Board'!$B$2:$P$16,VLOOKUP(Scorekeeping!V23,'Standard Board Scores'!$R:$U,3,FALSE),VLOOKUP(Scorekeeping!V23,'Standard Board Scores'!$R:$U,4,FALSE)),\"\")),\"\")=0,\"\",IFERROR(IF(ISERROR(V23),\"\",IF(OR($D$9=\"Vertical\",$D$9=\"Single Letter\"),INDEX('Current Board'!$B$2:$P$16,VLOOKUP(Scorekeeping!V23,'Standard Board Scores'!$R:$U,3,FALSE),VLOOKUP(Scorekeeping!V23,'Standard Board Scores'!$R:$U,4,FALSE)),\"\")),\"\")),\"\")","v":""},{"$f":"IF(V24<>\"\",IF(IFERROR(IF(W23=\"\",\"\",IF(OR($D$9=\"Vertical\",$D$9=\"Single Letter\"),INDEX('Current Board'!$B$2:$P$16,VLOOKUP(Scorekeeping!W23,'Standard Board Scores'!$R:$U,3,FALSE),VLOOKUP(Scorekeeping!W23,'Standard Board Scores'!$R:$U,4,FALSE)),\"\")),\"\")=0,\"\",IFERROR(IF(ISERROR(W23),\"\",IF(OR($D$9=\"Vertical\",$D$9=\"Single Letter\"),INDEX('Current Board'!$B$2:$P$16,VLOOKUP(Scorekeeping!W23,'Standard Board Scores'!$R:$U,3,FALSE),VLOOKUP(Scorekeeping!W23,'Standard Board Scores'!$R:$U,4,FALSE)),\"\")),\"\")),\"\")","v":""},{"$f":"IF(W24<>\"\",IF(IFERROR(IF(X23=\"\",\"\",IF(OR($D$9=\"Vertical\",$D$9=\"Single Letter\"),INDEX('Current Board'!$B$2:$P$16,VLOOKUP(Scorekeeping!X23,'Standard Board Scores'!$R:$U,3,FALSE),VLOOKUP(Scorekeeping!X23,'Standard Board Scores'!$R:$U,4,FALSE)),\"\")),\"\")=0,\"\",IFERROR(IF(ISERROR(X23),\"\",IF(OR($D$9=\"Vertical\",$D$9=\"Single Letter\"),INDEX('Current Board'!$B$2:$P$16,VLOOKUP(Scorekeeping!X23,'Standard Board Scores'!$R:$U,3,FALSE),VLOOKUP(Scorekeeping!X23,'Standard Board Scores'!$R:$U,4,FALSE)),\"\")),\"\")),\"\")","v":""},{"$f":"IF(X24<>\"\",IF(IFERROR(IF(Y23=\"\",\"\",IF(OR($D$9=\"Vertical\",$D$9=\"Single Letter\"),INDEX('Current Board'!$B$2:$P$16,VLOOKUP(Scorekeeping!Y23,'Standard Board Scores'!$R:$U,3,FALSE),VLOOKUP(Scorekeeping!Y23,'Standard Board Scores'!$R:$U,4,FALSE)),\"\")),\"\")=0,\"\",IFERROR(IF(ISERROR(Y23),\"\",IF(OR($D$9=\"Vertical\",$D$9=\"Single Letter\"),INDEX('Current Board'!$B$2:$P$16,VLOOKUP(Scorekeeping!Y23,'Standard Board Scores'!$R:$U,3,FALSE),VLOOKUP(Scorekeeping!Y23,'Standard Board Scores'!$R:$U,4,FALSE)),\"\")),\"\")),\"\")","v":""}]
[null,null,null,{"$f":"IF(IFERROR(IF(ISERROR(D$5),\"\",IF(OR($D$10=\"Vertical\",$D$10=\"Single Letter\"),INDEX('Current Board'!$B$2:$P$16,VLOOKUP(Scorekeeping!D24,'Standard Board Scores'!$R:$U,3,FALSE),VLOOKUP(Scorekeeping!D24,'Standard Board Scores'!$R:$U,4,FALSE)),\"\")),\"\")=0,\"\",IFERROR(IF(ISERROR(D$5),\"\",IF(OR($D$10=\"Vertical\",$D$10=\"Single Letter\"),INDEX('Current Board'!$B$2:$P$16,VLOOKUP(Scorekeeping!D24,'Standard Board Scores'!$R:$U,3,FALSE),VLOOKUP(Scorekeeping!D24,'Standard Board Scores'!$R:$U,4,FALSE)),\"\")),\"\"))","v":""},{"$f":"IF(IFERROR(IF(ISERROR(E$5),\"\",IF(OR($D$10=\"Vertical\",$D$10=\"Single Letter\"),INDEX('Current Board'!$B$2:$P$16,VLOOKUP(Scorekeeping!E24,'Standard Board Scores'!$R:$U,3,FALSE),VLOOKUP(Scorekeeping!E24,'Standard Board Scores'!$R:$U,4,FALSE)),\"\")),\"\")=0,\"\",IFERROR(IF(ISERROR(E$5),\"\",IF(OR($D$10=\"Vertical\",$D$10=\"Single Letter\"),INDEX('Current Board'!$B$2:$P$16,VLOOKUP(Scorekeeping!E24,'Standard Board Scores'!$R:$U,3,FALSE),VLOOKUP(Scorekeeping!E24,'Standard Board Scores'!$R:$U,4,FALSE)),\"\")),\"\"))","v":""},{"$f":"IF(IFERROR(IF(ISERROR(F$5),\"\",IF(OR($D$10=\"Vertical\",$D$10=\"Single Letter\"),INDEX('Current Board'!$B$2:$P$16,VLOOKUP(Scorekeeping!F24,'Standard Board Scores'!$R:$U,3,FALSE),VLOOKUP(Scorekeeping!F24,'Standard Board Scores'!$R:$U,4,FALSE)),\"\")),\"\")=0,\"\",IFERROR(IF(ISERROR(F$5),\"\",IF(OR($D$10=\"Vertical\",$D$10=\"Single Letter\"),INDEX('Current Board'!$B$2:$P$16,VLOOKUP(Scorekeeping!F24,'Standard Board Scores'!$R:$U,3,FALSE),VLOOKUP(Scorekeeping!F24,'Standard Board Scores'!$R:$U,4,FALSE)),\"\")),\"\"))","v":""},{"$f":"IF(IFERROR(IF(ISERROR(G$5),\"\",IF(OR($D$10=\"Vertical\",$D$10=\"Single Letter\"),INDEX('Current Board'!$B$2:$P$16,VLOOKUP(Scorekeeping!G24,'Standard Board Scores'!$R:$U,3,FALSE),VLOOKUP(Scorekeeping!G24,'Standard Board Scores'!$R:$U,4,FALSE)),\"\")),\"\")=0,\"\",IFERROR(IF(ISERROR(G$5),\"\",IF(OR($D$10=\"Vertical\",$D$10=\"Single Letter\"),INDEX('Current Board'!$B$2:$P$16,VLOOKUP(Scorekeeping!G24,'Standard Board Scores'!$R:$U,3,FALSE),VLOOKUP(Scorekeeping!G24,'Standard Board Scores'!$R:$U,4,FALSE)),\"\")),\"\"))","v":""},{"$f":"IF(IFERROR(IF(ISERROR(H$5),\"\",IF(OR($D$10=\"Vertical\",$D$10=\"Single Letter\"),INDEX('Current Board'!$B$2:$P$16,VLOOKUP(Scorekeeping!H24,'Standard Board Scores'!$R:$U,3,FALSE),VLOOKUP(Scorekeeping!H24,'Standard Board Scores'!$R:$U,4,FALSE)),\"\")),\"\")=0,\"\",IFERROR(IF(ISERROR(H$5),\"\",IF(OR($D$10=\"Vertical\",$D$10=\"Single Letter\"),INDEX('Current Board'!$B$2:$P$16,VLOOKUP(Scorekeeping!H24,'Standard Board Scores'!$R:$U,3,FALSE),VLOOKUP(Scorekeeping!H24,'Standard Board Scores'!$R:$U,4,FALSE)),\"\")),\"\"))","v":""},{"$f":"IF(IFERROR(IF(ISERROR(I$5),\"\",IF(OR($D$10=\"Vertical\",$D$10=\"Single Letter\"),INDEX('Current Board'!$B$2:$P$16,VLOOKUP(Scorekeeping!I24,'Standard Board Scores'!$R:$U,3,FALSE),VLOOKUP(Scorekeeping!I24,'Standard Board Scores'!$R:$U,4,FALSE)),\"\")),\"\")=0,\"\",IFERROR(IF(ISERROR(I$5),\"\",IF(OR($D$10=\"Vertical\",$D$10=\"Single Letter\"),INDEX('Current Board'!$B$2:$P$16,VLOOKUP(Scorekeeping!I24,'Standard Board Scores'!$R:$U,3,FALSE),VLOOKUP(Scorekeeping!I24,'Standard Board Scores'!$R:$U,4,FALSE)),\"\")),\"\"))","v":""},{"$f":"IF(IFERROR(IF(ISERROR(J$5),\"\",IF(OR($D$10=\"Vertical\",$D$10=\"Single Letter\"),INDEX('Current Board'!$B$2:$P$16,VLOOKUP(Scorekeeping!J24,'Standard Board Scores'!$R:$U,3,FALSE),VLOOKUP(Scorekeeping!J24,'Standard Board Scores'!$R:$U,4,FALSE)),\"\")),\"\")=0,\"\",IFERROR(IF(ISERROR(J$5),\"\",IF(OR($D$10=\"Vertical\",$D$10=\"Single Letter\"),INDEX('Current Board'!$B$2:$P$16,VLOOKUP(Scorekeeping!J24,'Standard Board Scores'!$R:$U,3,FALSE),VLOOKUP(Scorekeeping!J24,'Standard Board Scores'!$R:$U,4,FALSE)),\"\")),\"\"))","v":""},{"$f":"IFERROR(VLOOKUP(K24,'Tiles Remaining'!$A:$C,3,FALSE),\"\")","v":""},{"$f":"IFERROR(VLOOKUP(L24,'Tiles Remaining'!$A:$C,3,FALSE),\"\")","v":""},{"$f":"IFERROR(VLOOKUP(M24,'Tiles Remaining'!$A:$C,3,FALSE),\"\")","v":""},{"$f":"IFERROR(VLOOKUP(N24,'Tiles Remaining'!$A:$C,3,FALSE),\"\")","v":""},{"$f":"IFERROR(VLOOKUP(O24,'Tiles Remaining'!$A:$C,3,FALSE),\"\")","v":""},{"$f":"IFERROR(VLOOKUP(P24,'Tiles Remaining'!$A:$C,3,FALSE),\"\")","v":""},{"$f":"IFERROR(VLOOKUP(Q24,'Tiles Remaining'!$A:$C,3,FALSE),\"\")","v":""},{"$f":"IFERROR(VLOOKUP(R24,'Tiles Remaining'!$A:$C,3,FALSE),\"\")","v":""},{"$f":"IFERROR(VLOOKUP(S24,'Tiles Remaining'!$A:$C,3,FALSE),\"\")","v":""},{"$f":"IFERROR(VLOOKUP(T24,'Tiles Remaining'!$A:$C,3,FALSE),\"\")","v":""},{"$f":"IFERROR(VLOOKUP(U24,'Tiles Remaining'!$A:$C,3,FALSE),\"\")","v":""},{"$f":"IFERROR(VLOOKUP(V24,'Tiles Remaining'!$A:$C,3,FALSE),\"\")","v":""},{"$f":"IFERROR(VLOOKUP(W24,'Tiles Remaining'!$A:$C,3,FALSE),\"\")","v":""},{"$f":"IFERROR(VLOOKUP(X24,'Tiles Remaining'!$A:$C,3,FALSE),\"\")","v":""},{"$f":"IFERROR(VLOOKUP(Y24,'Tiles Remaining'!$A:$C,3,FALSE),\"\")","v":""},{"$f":"SUM(K25:Y25)","v":0}]
[null,"Vertical Top Side (for Horizontal)",null,{"$f":"IFERROR(CONCATENATE(LEFT(D2),VALUE(REPLACE(D2,1,1,\"\"))-1),\"\")","v":""},"","","","","","",null,"Vertical 3 - Side A"]
[null,null,null,{"$f":"IF(IFERROR(IF(ISERROR(D$5),\"\",IF(OR($D$10=\"Horizontal\",$D$10=\"Single Letter\"),INDEX('Current Board'!$B$2:$P$16,VLOOKUP(Scorekeeping!D26,'Standard Board Scores'!$R:$U,3,FALSE),VLOOKUP(Scorekeeping!D26,'Standard Board Scores'!$R:$U,4,FALSE)),\"\")),\"\")=0,\"\",IFERROR(IF(ISERROR(D$5),\"\",IF(OR($D$10=\"Horizontal\",$D$10=\"Single Letter\"),INDEX('Current Board'!$B$2:$P$16,VLOOKUP(Scorekeeping!D26,'Standard Board Scores'!$R:$U,3,FALSE),VLOOKUP(Scorekeeping!D26,'Standard Board Scores'!$R:$U,4,FALSE)),\"\")),\"\"))","v":""},{"$f":"IF(IFERROR(IF(ISERROR(E$5),\"\",IF(OR($D$10=\"Horizontal\",$D$10=\"Single Letter\"),INDEX('Current Board'!$B$2:$P$16,VLOOKUP(Scorekeeping!E26,'Standard Board Scores'!$R:$U,3,FALSE),VLOOKUP(Scorekeeping!E26,'Standard Board Scores'!$R:$U,4,FALSE)),\"\")),\"\")=0,\"\",IFERROR(IF(ISERROR(E$5),\"\",IF(OR($D$10=\"Horizontal\",$D$10=\"Single Letter\"),INDEX('Current Board'!$B$2:$P$16,VLOOKUP(Scorekeeping!E26,'Standard Board Scores'!$R:$U,3,FALSE),VLOOKUP(Scorekeeping!E26,'Standard Board Scores'!$R:$U,4,FALSE)),\"\")),\"\"))","v":""},{"$f":"IF(IFERROR(IF(ISERROR(F$5),\"\",IF(OR($D$10=\"Horizontal\",$D$10=\"Single Letter\"),INDEX('Current Board'!$B$2:$P$16,VLOOKUP(Scorekeeping!F26,'Standard Board Scores'!$R:$U,3,FALSE),VLOOKUP(Scorekeeping!F26,'Standard Board Scores'!$R:$U,4,FALSE)),\"\")),\"\")=0,\"\",IFERROR(IF(ISERROR(F$5),\"\",IF(OR($D$10=\"Horizontal\",$D$10=\"Single Letter\"),INDEX('Current Board'!$B$2:$P$16,VLOOKUP(Scorekeeping!F26,'Standard Board Scores'!$R:$U,3,FALSE),VLOOKUP(Scorekeeping!F26,'Standard Board Scores'!$R:$U,4,FALSE)),\"\")),\"\"))","v":""},{"$f":"IF(IFERROR(IF(ISERROR(G$5),\"\",IF(OR($D$10=\"Horizontal\",$D$10=\"Single Letter\"),INDEX('Current Board'!$B$2:$P$16,VLOOKUP(Scorekeeping!G26,'Standard Board Scores'!$R:$U,3,FALSE),VLOOKUP(Scorekeeping!G26,'Standard Board Scores'!$R:$U,4,FALSE)),\"\")),\"\")=0,\"\",IFERROR(IF(ISERROR(G$5),\"\",IF(OR($D$10=\"Horizontal\",$D$10=\"Single Letter\"),INDEX('Current Board'!$B$2:$P$16,VLOOKUP(Scorekeeping!G26,'Standard Board Scores'!$R:$U,3,FALSE),VLOOKUP(Scorekeeping!G26,'Standard Board Scores'!$R:$U,4,FALSE)),\"\")),\"\"))","v":""},{"$f":"IF(IFERROR(IF(ISERROR(H$5),\"\",IF(OR($D$10=\"Horizontal\",$D$10=\"Single Letter\"),INDEX('Current Board'!$B$2:$P$16,VLOOKUP(Scorekeeping!H26,'Standard Board Scores'!$R:$U,3,FALSE),VLOOKUP(Scorekeeping!H26,'Standard Board Scores'!$R:$U,4,FALSE)),\"\")),\"\")=0,\"\",IFERROR(IF(ISERROR(H$5),\"\",IF(OR($D$10=\"Horizontal\",$D$10=\"Single Letter\"),INDEX('Current Board'!$B$2:$P$16,VLOOKUP(Scorekeeping!H26,'Standard Board Scores'!$R:$U,3,FALSE),VLOOKUP(Scorekeeping!H26,'Standard Board Scores'!$R:$U,4,FALSE)),\"\")),\"\"))","v":""},{"$f":"IF(IFERROR(IF(ISERROR(I$5),\"\",IF(OR($D$10=\"Horizontal\",$D$10=\"Single Letter\"),INDEX('Current Board'!$B$2:$P$16,VLOOKUP(Scorekeeping!I26,'Standard Board Scores'!$R:$U,3,FALSE),VLOOKUP(Scorekeeping!I26,'Standard Board Scores'!$R:$U,4,FALSE)),\"\")),\"\")=0,\"\",IFERROR(IF(ISERROR(I$5),\"\",IF(OR($D$10=\"Horizontal\",$D$10=\"Single Letter\"),INDEX('Current Board'!$B$2:$P$16,VLOOKUP(Scorekeeping!I26,'Standard Board Scores'!$R:$U,3,FALSE),VLOOKUP(Scorekeeping!I26,'Standard Board Scores'!$R:$U,4,FALSE)),\"\")),\"\"))","v":""},{"$f":"IF(IFERROR(IF(ISERROR(J$5),\"\",IF(OR($D$10=\"Horizontal\",$D$10=\"Single Letter\"),INDEX('Current Board'!$B$2:$P$16,VLOOKUP(Scorekeeping!J26,'Standard Board Scores'!$R:$U,3,FALSE),VLOOKUP(Scorekeeping!J26,'Standard Board Scores'!$R:$U,4,FALSE)),\"\")),\"\")=0,\"\",IFERROR(IF(ISERROR(J$5),\"\",IF(OR($D$10=\"Horizontal\",$D$10=\"Single Letter\"),INDEX('Current Board'!$B$2:$P$16,VLOOKUP(Scorekeeping!J26,'Standard Board Scores'!$R:$U,3,FALSE),VLOOKUP(Scorekeeping!J26,'Standard Board Scores'!$R:$U,4,FALSE)),\"\")),\"\"))","v":""},null,1,2,3,4,5,6,7,8,9,10,11,12,13,14]
[null,"Vertical Bottom Side (for Horizontal)",null,{"$f":"IFERROR(CONCATENATE(LEFT(D2),VALUE(REPLACE(D2,1,1,\"\"))+1),\"\")","v":""},"","","","","","",{"$f":"F16","v":""},{"$f":"IF(AND(K28<>\"\",LEFT(K28,1)<>\"B\",LEFT(K28,1)<>\"A\"),CONCATENATE(CHAR(CODE(LEFT(K28,1))-1),REPLACE(K28,1,1,\"\")),\"\")","v":""},{"$f":"IF(AND(L28<>\"\",LEFT(L28,1)<>\"B\",LEFT(L28,1)<>\"A\"),CONCATENATE(CHAR(CODE(LEFT(L28,1))-1),REPLACE(L28,1,1,\"\")),\"\")","v":""},"","","","","","","","","","","",""]
[null,null,null,{"$f":"IF(IFERROR(IF(ISERROR(D$5),\"\",IF(OR($D$10=\"Horizontal\",$D$10=\"Single Letter\"),INDEX('Current Board'!$B$2:$P$16,VLOOKUP(Scorekeeping!D28,'Standard Board Scores'!$R:$U,3,FALSE),VLOOKUP(Scorekeeping!D28,'Standard Board Scores'!$R:$U,4,FALSE)),\"\")),\"\")=0,\"\",IFERROR(IF(ISERROR(D$5),\"\",IF(OR($D$10=\"Horizontal\",$D$10=\"Single Letter\"),INDEX('Current Board'!$B$2:$P$16,VLOOKUP(Scorekeeping!D28,'Standard Board Scores'!$R:$U,3,FALSE),VLOOKUP(Scorekeeping!D28,'Standard Board Scores'!$R:$U,4,FALSE)),\"\")),\"\"))","v":""},{"$f":"IF(IFERROR(IF(ISERROR(E$5),\"\",IF(OR($D$10=\"Horizontal\",$D$10=\"Single Letter\"),INDEX('Current Board'!$B$2:$P$16,VLOOKUP(Scorekeeping!E28,'Standard Board Scores'!$R:$U,3,FALSE),VLOOKUP(Scorekeeping!E28,'Standard Board Scores'!$R:$U,4,FALSE)),\"\")),\"\")=0,\"\",IFERROR(IF(ISERROR(E$5),\"\",IF(OR($D$10=\"Horizontal\",$D$10=\"Single Letter\"),INDEX('Current Board'!$B$2:$P$16,VLOOKUP(Scorekeeping!E28,'Standard Board Scores'!$R:$U,3,FALSE),VLOOKUP(Scorekeeping!E28,'Standard Board Scores'!$R:$U,4,FALSE)),\"\")),\"\"))","v":""},{"$f":"IF(IFERROR(IF(ISERROR(F$5),\"\",IF(OR($D$10=\"Horizontal\",$D$10=\"Single Letter\"),INDEX('Current Board'!$B$2:$P$16,VLOOKUP(Scorekeeping!F28,'Standard Board Scores'!$R:$U,3,FALSE),VLOOKUP(Scorekeeping!F28,'Standard Board Scores'!$R:$U,4,FALSE)),\"\")),\"\")=0,\"\",IFERROR(IF(ISERROR(F$5),\"\",IF(OR($D$10=\"Horizontal\",$D$10=\"Single Letter\"),INDEX('Current Board'!$B$2:$P$16,VLOOKUP(Scorekeeping!F28,'Standard Board Scores'!$R:$U,3,FALSE),VLOOKUP(Scorekeeping!F28,'Standard Board Scores'!$R:$U,4,FALSE)),\"\")),\"\"))","v":""},{"$f":"IF(IFERROR(IF(ISERROR(G$5),\"\",IF(OR($D$10=\"Horizontal\",$D$10=\"Single Letter\"),INDEX('Current Board'!$B$2:$P$16,VLOOKUP(Scorekeeping!G28,'Standard Board Scores'!$R:$U,3,FALSE),VLOOKUP(Scorekeeping!G28,'Standard Board Scores'!$R:$U,4,FALSE)),\"\")),\"\")=0,\"\",IFERROR(IF(ISERROR(G$5),\"\",IF(OR($D$10=\"Horizontal\",$D$10=\"Single Letter\"),INDEX('Current Board'!$B$2:$P$16,VLOOKUP(Scorekeeping!G28,'Standard Board Scores'!$R:$U,3,FALSE),VLOOKUP(Scorekeeping!G28,'Standard Board Scores'!$R:$U,4,FALSE)),\"\")),\"\"))","v":""},{"$f":"IF(IFERROR(IF(ISERROR(H$5),\"\",IF(OR($D$10=\"Horizontal\",$D$10=\"Single Letter\"),INDEX('Current Board'!$B$2:$P$16,VLOOKUP(Scorekeeping!H28,'Standard Board Scores'!$R:$U,3,FALSE),VLOOKUP(Scorekeeping!H28,'Standard Board Scores'!$R:$U,4,FALSE)),\"\")),\"\")=0,\"\",IFERROR(IF(ISERROR(H$5),\"\",IF(OR($D$10=\"Horizontal\",$D$10=\"Single Letter\"),INDEX('Current Board'!$B$2:$P$16,VLOOKUP(Scorekeeping!H28,'Standard Board Scores'!$R:$U,3,FALSE),VLOOKUP(Scorekeeping!H28,'Standard Board Scores'!$R:$U,4,FALSE)),\"\")),\"\"))","v":""},{"$f":"IF(IFERROR(IF(ISERROR(I$5),\"\",IF(OR($D$10=\"Horizontal\",$D$10=\"Single Letter\"),INDEX('Current Board'!$B$2:$P$16,VLOOKUP(Scorekeeping!I28,'Standard Board Scores'!$R:$U,3,FALSE),VLOOKUP(Scorekeeping!I28,'Standard Board Scores'!$R:$U,4,FALSE)),\"\")),\"\")=0,\"\",IFERROR(IF(ISERROR(I$5),\"\",IF(OR($D$10=\"Horizontal\",$D$10=\"Single Letter\"),INDEX('Current Board'!$B$2:$P$16,VLOOKUP(Scorekeeping!I28,'Standard Board Scores'!$R:$U,3,FALSE),VLOOKUP(Scorekeeping!I28,'Standard Board Scores'!$R:$U,4,FALSE)),\"\")),\"\"))","v":""},{"$f":"IF(IFERROR(IF(ISERROR(J$5),\"\",IF(OR($D$10=\"Horizontal\",$D$10=\"Single Letter\"),INDEX('Current Board'!$B$2:$P$16,VLOOKUP(Scorekeeping!J28,'Standard Board Scores'!$R:$U,3,FALSE),VLOOKUP(Scorekeeping!J28,'Standard Board Scores'!$R:$U,4,FALSE)),\"\")),\"\")=0,\"\",IFERROR(IF(ISERROR(J$5),\"\",IF(OR($D$10=\"Horizontal\",$D$10=\"Single Letter\"),INDEX('Current Board'!$B$2:$P$16,VLOOKUP(Scorekeeping!J28,'Standard Board Scores'!$R:$U,3,FALSE),VLOOKUP(Scorekeeping!J28,'Standard Board Scores'!$R:$U,4,FALSE)),\"\")),\"\"))","v":""},{"$f":"IF(IFERROR(IF(K28=\"\",\"\",IF(OR($D$9=\"Vertical\",$D$9=\"Single Letter\"),INDEX('Current Board'!$B$2:$P$16,VLOOKUP(Scorekeeping!K28,'Standard Board Scores'!$R:$U,3,FALSE),VLOOKUP(Scorekeeping!K28,'Standard Board Scores'!$R:$U,4,FALSE)),\"\")),\"\")=0,\"\",IFERROR(IF(ISERROR(K28),\"\",IF(OR($D$9=\"Vertical\",$D$9=\"Single Letter\"),INDEX('Current Board'!$B$2:$P$16,VLOOKUP(Scorekeeping!K28,'Standard Board Scores'!$R:$U,3,FALSE),VLOOKUP(Scorekeeping!K28,'Standard Board Scores'!$R:$U,4,FALSE)),\"\")),\"\"))","v":""},{"$f":"IF(K29<>\"\",IF(IFERROR(IF(L28=\"\",\"\",IF(OR($D$9=\"Vertical\",$D$9=\"Single Letter\"),INDEX('Current Board'!$B$2:$P$16,VLOOKUP(Scorekeeping!L28,'Standard Board Scores'!$R:$U,3,FALSE),VLOOKUP(Scorekeeping!L28,'Standard Board Scores'!$R:$U,4,FALSE)),\"\")),\"\")=0,\"\",IFERROR(IF(ISERROR(L28),\"\",IF(OR($D$9=\"Vertical\",$D$9=\"Single Letter\"),INDEX('Current Board'!$B$2:$P$16,VLOOKUP(Scorekeeping!L28,'Standard Board Scores'!$R:$U,3,FALSE),VLOOKUP(Scorekeeping!L28,'Standard Board Scores'!$R:$U,4,FALSE)),\"\")),\"\")),\"\")","v":""},{"$f":"IF(L29<>\"\",IF(IFERROR(IF(M28=\"\",\"\",IF(OR($D$9=\"Vertical\",$D$9=\"Single Letter\"),INDEX('Current Board'!$B$2:$P$16,VLOOKUP(Scorekeeping!M28,'Standard Board Scores'!$R:$U,3,FALSE),VLOOKUP(Scorekeeping!M28,'Standard Board Scores'!$R:$U,4,FALSE)),\"\")),\"\")=0,\"\",IFERROR(IF(ISERROR(M28),\"\",IF(OR($D$9=\"Vertical\",$D$9=\"Single Letter\"),INDEX('Current Board'!$B$2:$P$16,VLOOKUP(Scorekeeping!M28,'Standard Board Scores'!$R:$U,3,FALSE),VLOOKUP(Scorekeeping!M28,'Standard Board Scores'!$R:$U,4,FALSE)),\"\")),\"\")),\"\")","v":""},{"$f":"IF(M29<>\"\",IF(IFERROR(IF(N28=\"\",\"\",IF(OR($D$9=\"Vertical\",$D$9=\"Single Letter\"),INDEX('Current Board'!$B$2:$P$16,VLOOKUP(Scorekeeping!N28,'Standard Board Scores'!$R:$U,3,FALSE),VLOOKUP(Scorekeeping!N28,'Standard Board Scores'!$R:$U,4,FALSE)),\"\")),\"\")=0,\"\",IFERROR(IF(ISERROR(N28),\"\",IF(OR($D$9=\"Vertical\",$D$9=\"Single Letter\"),INDEX('Current Board'!$B$2:$P$16,VLOOKUP(Scorekeeping!N28,'Standard Board Scores'!$R:$U,3,FALSE),VLOOKUP(Scorekeeping!N28,'Standard Board Scores'!$R:$U,4,FALSE)),\"\")),\"\")),\"\")","v":""},{"$f":"IF(N29<>\"\",IF(IFERROR(IF(O28=\"\",\"\",IF(OR($D$9=\"Vertical\",$D$9=\"Single Letter\"),INDEX('Current Board'!$B$2:$P$16,VLOOKUP(Scorekeeping!O28,'Standard Board Scores'!$R:$U,3,FALSE),VLOOKUP(Scorekeeping!O28,'Standard Board Scores'!$R:$U,4,FALSE)),\"\")),\"\")=0,\"\",IFERROR(IF(ISERROR(O28),\"\",IF(OR($D$9=\"Vertical\",$D$9=\"Single Letter\"),INDEX('Current Board'!$B$2:$P$16,VLOOKUP(Scorekeeping!O28,'Standard Board Scores'!$R:$U,3,FALSE),VLOOKUP(Scorekeeping!O28,'Standard Board Scores'!$R:$U,4,FALSE)),\"\")),\"\")),\"\")","v":""},{"$f":"IF(O29<>\"\",IF(IFERROR(IF(P28=\"\",\"\",IF(OR($D$9=\"Vertical\",$D$9=\"Single Letter\"),INDEX('Current Board'!$B$2:$P$16,VLOOKUP(Scorekeeping!P28,'Standard Board Scores'!$R:$U,3,FALSE),VLOOKUP(Scorekeeping!P28,'Standard Board Scores'!$R:$U,4,FALSE)),\"\")),\"\")=0,\"\",IFERROR(IF(ISERROR(P28),\"\",IF(OR($D$9=\"Vertical\",$D$9=\"Single Letter\"),INDEX('Current Board'!$B$2:$P$16,VLOOKUP(Scorekeeping!P28,'Standard Board Scores'!$R:$U,3,FALSE),VLOOKUP(Scorekeeping!P28,'Standard Board Scores'!$R:$U,4,FALSE)),\"\")),\"\")),\"\")","v":""},{"$f":"IF(P29<>\"\",IF(IFERROR(IF(Q28=\"\",\"\",IF(OR($D$9=\"Vertical\",$D$9=\"Single Letter\"),INDEX('Current Board'!$B$2:$P$16,VLOOKUP(Scorekeeping!Q28,'Standard Board Scores'!$R:$U,3,FALSE),VLOOKUP(Scorekeeping!Q28,'Standard Board Scores'!$R:$U,4,FALSE)),\"\")),\"\")=0,\"\",IFERROR(IF(ISERROR(Q28),\"\",IF(OR($D$9=\"Vertical\",$D$9=\"Single Letter\"),INDEX('Current Board'!$B$2:$P$16,VLOOKUP(Scorekeeping!Q28,'Standard Board Scores'!$R:$U,3,FALSE),VLOOKUP(Scorekeeping!Q28,'Standard Board Scores'!$R:$U,4,FALSE)),\"\")),\"\")),\"\")","v":""},{"$f":"IF(Q29<>\"\",IF(IFERROR(IF(R28=\"\",\"\",IF(OR($D$9=\"Vertical\",$D$9=\"Single Letter\"),INDEX('Current Board'!$B$2:$P$16,VLOOKUP(Scorekeeping!R28,'Standard Board Scores'!$R:$U,3,FALSE),VLOOKUP(Scorekeeping!R28,'Standard Board Scores'!$R:$U,4,FALSE)),\"\")),\"\")=0,\"\",IFERROR(IF(ISERROR(R28),\"\",IF(OR($D$9=\"Vertical\",$D$9=\"Single Letter\"),INDEX('Current Board'!$B$2:$P$16,VLOOKUP(Scorekeeping!R28,'Standard Board Scores'!$R:$U,3,FALSE),VLOOKUP(Scorekeeping!R28,'Standard Board Scores'!$R:$U,4,FALSE)),\"\")),\"\")),\"\")","v":""},{"$f":"IF(R29<>\"\",IF(IFERROR(IF(S28=\"\",\"\",IF(OR($D$9=\"Vertical\",$D$9=\"Single Letter\"),INDEX('Current Board'!$B$2:$P$16,VLOOKUP(Scorekeeping!S28,'Standard Board Scores'!$R:$U,3,FALSE),VLOOKUP(Scorekeeping!S28,'Standard Board Scores'!$R:$U,4,FALSE)),\"\")),\"\")=0,\"\",IFERROR(IF(ISERROR(S28),\"\",IF(OR($D$9=\"Vertical\",$D$9=\"Single Letter\"),INDEX('Current Board'!$B$2:$P$16,VLOOKUP(Scorekeeping!S28,'Standard Board Scores'!$R:$U,3,FALSE),VLOOKUP(Scorekeeping!S28,'Standard Board Scores'!$R:$U,4,FALSE)),\"\")),\"\")),\"\")","v":""},{"$f":"IF(S29<>\"\",IF(IFERROR(IF(T28=\"\",\"\",IF(OR($D$9=\"Vertical\",$D$9=\"Single Letter\"),INDEX('Current Board'!$B$2:$P$16,VLOOKUP(Scorekeeping!T28,'Standard Board Scores'!$R:$U,3,FALSE),VLOOKUP(Scorekeeping!T28,'Standard Board Scores'!$R:$U,4,FALSE)),\"\")),\"\")=0,\"\",IFERROR(IF(ISERROR(T28),\"\",IF(OR($D$9=\"Vertical\",$D$9=\"Single Letter\"),INDEX('Current Board'!$B$2:$P$16,VLOOKUP(Scorekeeping!T28,'Standard Board Scores'!$R:$U,3,FALSE),VLOOKUP(Scorekeeping!T28,'Standard Board Scores'!$R:$U,4,FALSE)),\"\")),\"\")),\"\")","v":""},{"$f":"IF(T29<>\"\",IF(IFERROR(IF(U28=\"\",\"\",IF(OR($D$9=\"Vertical\",$D$9=\"Single Letter\"),INDEX('Current Board'!$B$2:$P$16,VLOOKUP(Scorekeeping!U28,'Standard Board Scores'!$R:$U,3,FALSE),VLOOKUP(Scorekeeping!U28,'Standard Board Scores'!$R:$U,4,FALSE)),\"\")),\"\")=0,\"\",IFERROR(IF(ISERROR(U28),\"\",IF(OR($D$9=\"Vertical\",$D$9=\"Single Letter\"),INDEX('Current Board'!$B$2:$P$16,VLOOKUP(Scorekeeping!U28,'Standard Board Scores'!$R:$U,3,FALSE),VLOOKUP(Scorekeeping!U28,'Standard Board Scores'!$R:$U,4,FALSE)),\"\")),\"\")),\"\")","v":""},{"$f":"IF(U29<>\"\",IF(IFERROR(IF(V28=\"\",\"\",IF(OR($D$9=\"Vertical\",$D$9=\"Single Letter\"),INDEX('Current Board'!$B$2:$P$16,VLOOKUP(Scorekeeping!V28,'Standard Board Scores'!$R:$U,3,FALSE),VLOOKUP(Scorekeeping!V28,'Standard Board Scores'!$R:$U,4,FALSE)),\"\")),\"\")=0,\"\",IFERROR(IF(ISERROR(V28),\"\",IF(OR($D$9=\"Vertical\",$D$9=\"Single Letter\"),INDEX('Current Board'!$B$2:$P$16,VLOOKUP(Scorekeeping!V28,'Standard Board Scores'!$R:$U,3,FALSE),VLOOKUP(Scorekeeping!V28,'Standard Board Scores'!$R:$U,4,FALSE)),\"\")),\"\")),\"\")","v":""},{"$f":"IF(V29<>\"\",IF(IFERROR(IF(W28=\"\",\"\",IF(OR($D$9=\"Vertical\",$D$9=\"Single Letter\"),INDEX('Current Board'!$B$2:$P$16,VLOOKUP(Scorekeeping!W28,'Standard Board Scores'!$R:$U,3,FALSE),VLOOKUP(Scorekeeping!W28,'Standard Board Scores'!$R:$U,4,FALSE)),\"\")),\"\")=0,\"\",IFERROR(IF(ISERROR(W28),\"\",IF(OR($D$9=\"Vertical\",$D$9=\"Single Letter\"),INDEX('Current Board'!$B$2:$P$16,VLOOKUP(Scorekeeping!W28,'Standard Board Scores'!$R:$U,3,FALSE),VLOOKUP(Scorekeeping!W28,'Standard Board Scores'!$R:$U,4,FALSE)),\"\")),\"\")),\"\")","v":""},{"$f":"IF(W29<>\"\",IF(IFERROR(IF(X28=\"\",\"\",IF(OR($D$9=\"Vertical\",$D$9=\"Single Letter\"),INDEX('Current Board'!$B$2:$P$16,VLOOKUP(Scorekeeping!X28,'Standard Board Scores'!$R:$U,3,FALSE),VLOOKUP(Scorekeeping!X28,'Standard Board Scores'!$R:$U,4,FALSE)),\"\")),\"\")=0,\"\",IFERROR(IF(ISERROR(X28),\"\",IF(OR($D$9=\"Vertical\",$D$9=\"Single Letter\"),INDEX('Current Board'!$B$2:$P$16,VLOOKUP(Scorekeeping!X28,'Standard Board Scores'!$R:$U,3,FALSE),VLOOKUP(Scorekeeping!X28,'Standard Board Scores'!$R:$U,4,FALSE)),\"\")),\"\")),\"\")","v":""},{"$f":"IF(X29<>\"\",IF(IFERROR(IF(Y28=\"\",\"\",IF(OR($D$9=\"Vertical\",$D$9=\"Single Letter\"),INDEX('Current Board'!$B$2:$P$16,VLOOKUP(Scorekeeping!Y28,'Standard Board Scores'!$R:$U,3,FALSE),VLOOKUP(Scorekeeping!Y28,'Standard Board Scores'!$R:$U,4,FALSE)),\"\")),\"\")=0,\"\",IFERROR(IF(ISERROR(Y28),\"\",IF(OR($D$9=\"Vertical\",$D$9=\"Single Letter\"),INDEX('Current Board'!$B$2:$P$16,VLOOKUP(Scorekeeping!Y28,'Standard Board Scores'!$R:$U,3,FALSE),VLOOKUP(Scorekeeping!Y28,'Standard Board Scores'!$R:$U,4,FALSE)),\"\")),\"\")),\"\")","v":""}]
[null,"Double-Count - Secondary Word (for Horizontal)",null,{"$f":"IF(OR(D27<>\"\",D29<>\"\"),\"Yes\",\"No\")","v":"No"},{"$f":"IF(OR(E27<>\"\",E29<>\"\"),\"Yes\",\"No\")","v":"No"},{"$f":"IF(OR(F27<>\"\",F29<>\"\"),\"Yes\",\"No\")","v":"No"},{"$f":"IF(OR(G27<>\"\",G29<>\"\"),\"Yes\",\"No\")","v":"No"},{"$f":"IF(OR(H27<>\"\",H29<>\"\"),\"Yes\",\"No\")","v":"No"},{"$f":"IF(OR(I27<>\"\",I29<>\"\"),\"Yes\",\"No\")","v":"No"},{"$f":"IF(OR(J27<>\"\",J29<>\"\"),\"Yes\",\"No\")","v":"No"},{"$f":"IFERROR(VLOOKUP(K29,'Tiles Remaining'!$A:$C,3,FALSE),\"\")","v":""},{"$f":"IFERROR(VLOOKUP(L29,'Tiles Remaining'!$A:$C,3,FALSE),\"\")","v":""},{"$f":"IFERROR(VLOOKUP(M29,'Tiles Remaining'!$A:$C,3,FALSE),\"\")","v":""},{"$f":"IFERROR(VLOOKUP(N29,'Tiles Remaining'!$A:$C,3,FALSE),\"\")","v":""},{"$f":"IFERROR(VLOOKUP(O29,'Tiles Remaining'!$A:$C,3,FALSE),\"\")","v":""},{"$f":"IFERROR(VLOOKUP(P29,'Tiles Remaining'!$A:$C,3,FALSE),\"\")","v":""},{"$f":"IFERROR(VLOOKUP(Q29,'Tiles Remaining'!$A:$C,3,FALSE),\"\")","v":""},{"$f":"IFERROR(VLOOKUP(R29,'Tiles Remaining'!$A:$C,3,FALSE),\"\")","v":""},{"$f":"IFERROR(VLOOKUP(S29,'Tiles Remaining'!$A:$C,3,FALSE),\"\")","v":""},{"$f":"IFERROR(VLOOKUP(T29,'Tiles Remaining'!$A:$C,3,FALSE),\"\")","v":""},{"$f":"IFERROR(VLOOKUP(U29,'Tiles Remaining'!$A:$C,3,FALSE),\"\")","v":""},{"$f":"IFERROR(VLOOKUP(V29,'Tiles Remaining'!$A:$C,3,FALSE),\"\")","v":""},{"$f":"IFERROR(VLOOKUP(W29,'Tiles Remaining'!$A:$C,3,FALSE),\"\")","v":""},{"$f":"IFERROR(VLOOKUP(X29,'Tiles Remaining'!$A:$C,3,FALSE),\"\")","v":""},{"$f":"IFERROR(VLOOKUP(Y29,'Tiles Remaining'!$A:$C,3,FALSE),\"\")","v":""},{"$f":"SUM(K30:Y30)","v":0}]
[null,null,null,{"$f":"IF(D30=\"Yes\",D$5,0)","v":0},0,0,0,0,0,0,null,"Vertical 4 - Side A"]
[null,"Left (for Horizontal)",null,{"$f":"IFERROR(CONCATENATE(CHAR(CODE(LEFT(D2,1))-1),REPLACE(D2,1,1,\"\")),\"\")","v":""},{"$f":"\"\"","v":""},{"$f":"\"\"","v":""},{"$f":"\"\"","v":""},{"$f":"\"\"","v":""},{"$f":"\"\"","v":""},{"$f":"\"\"","v":""},null,1,2,3,4,5,6,7,8,9,10,11,12,13,14]
[null,null,null,{"$f":"IF(IFERROR(IF(ISERROR(D$5),\"\",IF(OR($D$10=\"Horizontal\",$D$10=\"Single Letter\"),INDEX('Current Board'!$B$2:$P$16,VLOOKUP(Scorekeeping!D32,'Standard Board Scores'!$R:$U,3,FALSE),VLOOKUP(Scorekeeping!D32,'Standard Board Scores'!$R:$U,4,FALSE)),\"\")),\"\")=0,\"\",IFERROR(IF(ISERROR(D$5),\"\",IF(OR($D$10=\"Horizontal\",$D$10=\"Single Letter\"),INDEX('Current Board'!$B$2:$P$16,VLOOKUP(Scorekeeping!D32,'Standard Board Scores'!$R:$U,3,FALSE),VLOOKUP(Scorekeeping!D32,'Standard Board Scores'!$R:$U,4,FALSE)),\"\")),\"\"))","v":""},{"$f":"IF(IFERROR(IF(ISERROR(E$5),\"\",IF(OR($D$10=\"Horizontal\",$D$10=\"Single Letter\"),INDEX('Current Board'!$B$2:$P$16,VLOOKUP(Scorekeeping!E32,'Standard Board Scores'!$R:$U,3,FALSE),VLOOKUP(Scorekeeping!E32,'Standard Board Scores'!$R:$U,4,FALSE)),\"\")),\"\")=0,\"\",IFERROR(IF(ISERROR(E$5),\"\",IF(OR($D$10=\"Horizontal\",$D$10=\"Single Letter\"),INDEX('Current Board'!$B$2:$P$16,VLOOKUP(Scorekeeping!E32,'Standard Board Scores'!$R:$U,3,FALSE),VLOOKUP(Scorekeeping!E32,'Standard Board Scores'!$R:$U,4,FALSE)),\"\")),\"\"))","v":""},{"$f":"IF(IFERROR(IF(ISERROR(F$5),\"\",IF(OR($D$10=\"Horizontal\",$D$10=\"Single Letter\"),INDEX('Current Board'!$B$2:$P$16,VLOOKUP(Scorekeeping!F32,'Standard Board Scores'!$R:$U,3,FALSE),VLOOKUP(Scorekeeping!F32,'Standard Board Scores'!$R:$U,4,FALSE)),\"\")),\"\")=0,\"\",IFERROR(IF(ISERROR(F$5),\"\",IF(OR($D$10=\"Horizontal\",$D$10=\"Single Letter\"),INDEX('Current Board'!$B$2:$P$16,VLOOKUP(Scorekeeping!F32,'Standard Board Scores'!$R:$U,3,FALSE),VLOOKUP(Scorekeeping!F32,'Standard Board Scores'!$R:$U,4,FALSE)),\"\")),\"\"))","v":""},{"$f":"IF(IFERROR(IF(ISERROR(G$5),\"\",IF(OR($D$10=\"Horizontal\",$D$10=\"Single Letter\"),INDEX('Current Board'!$B$2:$P$16,VLOOKUP(Scorekeeping!G32,'Standard Board Scores'!$R:$U,3,FALSE),VLOOKUP(Scorekeeping!G32,'Standard Board Scores'!$R:$U,4,FALSE)),\"\")),\"\")=0,\"\",IFERROR(IF(ISERROR(G$5),\"\",IF(OR($D$10=\"Horizontal\",$D$10=\"Single Letter\"),INDEX('Current Board'!$B$2:$P$16,VLOOKUP(Scorekeeping!G32,'Standard Board Scores'!$R:$U,3,FALSE),VLOOKUP(Scorekeeping!G32,'Standard Board Scores'!$R:$U,4,FALSE)),\"\")),\"\"))","v":""},{"$f":"IF(IFERROR(IF(ISERROR(H$5),\"\",IF(OR($D$10=\"Horizontal\",$D$10=\"Single Letter\"),INDEX('Current Board'!$B$2:$P$16,VLOOKUP(Scorekeeping!H32,'Standard Board Scores'!$R:$U,3,FALSE),VLOOKUP(Scorekeeping!H32,'Standard Board Scores'!$R:$U,4,FALSE)),\"\")),\"\")=0,\"\",IFERROR(IF(ISERROR(H$5),\"\",IF(OR($D$10=\"Horizontal\",$D$10=\"Single Letter\"),INDEX('Current Board'!$B$2:$P$16,VLOOKUP(Scorekeeping!H32,'Standard Board Scores'!$R:$U,3,FALSE),VLOOKUP(Scorekeeping!H32,'Standard Board Scores'!$R:$U,4,FALSE)),\"\")),\"\"))","v":""},{"$f":"IF(IFERROR(IF(ISERROR(I$5),\"\",IF(OR($D$10=\"Horizontal\",$D$10=\"Single Letter\"),INDEX('Current Board'!$B$2:$P$16,VLOOKUP(Scorekeeping!I32,'Standard Board Scores'!$R:$U,3,FALSE),VLOOKUP(Scorekeeping!I32,'Standard Board Scores'!$R:$U,4,FALSE)),\"\")),\"\")=0,\"\",IFERROR(IF(ISERROR(I$5),\"\",IF(OR($D$10=\"Horizontal\",$D$10=\"Single Letter\"),INDEX('Current Board'!$B$2:$P$16,VLOOKUP(Scorekeeping!I32,'Standard Board Scores'!$R:$U,3,FALSE),VLOOKUP(Scorekeeping!I32,'Standard Board Scores'!$R:$U,4,FALSE)),\"\")),\"\"))","v":""},{"$f":"IF(IFERROR(IF(ISERROR(J$5),\"\",IF(OR($D$10=\"Horizontal\",$D$10=\"Single Letter\"),INDEX('Current Board'!$B$2:$P$16,VLOOKUP(Scorekeeping!J32,'Standard Board Scores'!$R:$U,3,FALSE),VLOOKUP(Scorekeeping!J32,'Standard Board Scores'!$R:$U,4,FALSE)),\"\")),\"\")=0,\"\",IFERROR(IF(ISERROR(J$5),\"\",IF(OR($D$10=\"Horizontal\",$D$10=\"Single Letter\"),INDEX('Current Board'!$B$2:$P$16,VLOOKUP(Scorekeeping!J32,'Standard Board Scores'!$R:$U,3,FALSE),VLOOKUP(Scorekeeping!J32,'Standard Board Scores'!$R:$U,4,FALSE)),\"\")),\"\"))","v":""},{"$f":"G16","v":""},{"$f":"IF(AND(K33<>\"\",LEFT(K33,1)<>\"B\",LEFT(K33,1)<>\"A\"),CONCATENATE(CHAR(CODE(LEFT(K33,1))-1),REPLACE(K33,1,1,\"\")),\"\")","v":""},{"$f":"IF(AND(L33<>\"\",LEFT(L33,1)<>\"B\",LEFT(L33,1)<>\"A\"),CONCATENATE(CHAR(CODE(LEFT(L33,1))-1),REPLACE(L33,1,1,\"\")),\"\")","v":""},"","","","","","","","","","","",""]
[null,"Right (for Horizontal)",null,{"$f":"IF(E2=\"\",IFERROR(CONCATENATE(CHAR(CODE(LEFT(D2,1))+1),REPLACE(D2,1,1,\"\")),\"\"),\"\")","v":""},"","","","","",{"$f":"IF(K18=\"\",IFERROR(CONCATENATE(CHAR(CODE(LEFT(J2,1))+1),REPLACE(J2,1,1,\"\")),\"\"),\"\")","v":""},{"$f":"IF(IFERROR(IF(K33=\"\",\"\",IF(OR($D$9=\"Vertical\",$D$9=\"Single Letter\"),INDEX('Current Board'!$B$2:$P$16,VLOOKUP(Scorekeeping!K33,'Standard Board Scores'!$R:$U,3,FALSE),VLOOKUP(Scorekeeping!K33,'Standard Board Scores'!$R:$U,4,FALSE)),\"\")),\"\")=0,\"\",IFERROR(IF(ISERROR(K33),\"\",IF(OR($D$9=\"Vertical\",$D$9=\"Single Letter\"),INDEX('Current Board'!$B$2:$P$16,VLOOKUP(Scorekeeping!K33,'Standard Board Scores'!$R:$U,3,FALSE),VLOOKUP(Scorekeeping!K33,'Standard Board Scores'!$R:$U,4,FALSE)),\"\")),\"\"))","v":""},{"$f":"IF(K34<>\"\",IF(IFERROR(IF(L33=\"\",\"\",IF(OR($D$9=\"Vertical\",$D$9=\"Single Letter\"),INDEX('Current Board'!$B$2:$P$16,VLOOKUP(Scorekeeping!L33,'Standard Board Scores'!$R:$U,3,FALSE),VLOOKUP(Scorekeeping!L33,'Standard Board Scores'!$R:$U,4,FALSE)),\"\")),\"\")=0,\"\",IFERROR(IF(ISERROR(L33),\"\",IF(OR($D$9=\"Vertical\",$D$9=\"Single Letter\"),INDEX('Current Board'!$B$2:$P$16,VLOOKUP(Scorekeeping!L33,'Standard Board Scores'!$R:$U,3,FALSE),VLOOKUP(Scorekeeping!L33,'Standard Board Scores'!$R:$U,4,FALSE)),\"\")),\"\")),\"\")","v":""},{"$f":"IF(L34<>\"\",IF(IFERROR(IF(M33=\"\",\"\",IF(OR($D$9=\"Vertical\",$D$9=\"Single Letter\"),INDEX('Current Board'!$B$2:$P$16,VLOOKUP(Scorekeeping!M33,'Standard Board Scores'!$R:$U,3,FALSE),VLOOKUP(Scorekeeping!M33,'Standard Board Scores'!$R:$U,4,FALSE)),\"\")),\"\")=0,\"\",IFERROR(IF(ISERROR(M33),\"\",IF(OR($D$9=\"Vertical\",$D$9=\"Single Letter\"),INDEX('Current Board'!$B$2:$P$16,VLOOKUP(Scorekeeping!M33,'Standard Board Scores'!$R:$U,3,FALSE),VLOOKUP(Scorekeeping!M33,'Standard Board Scores'!$R:$U,4,FALSE)),\"\")),\"\")),\"\")","v":""},{"$f":"IF(M34<>\"\",IF(IFERROR(IF(N33=\"\",\"\",IF(OR($D$9=\"Vertical\",$D$9=\"Single Letter\"),INDEX('Current Board'!$B$2:$P$16,VLOOKUP(Scorekeeping!N33,'Standard Board Scores'!$R:$U,3,FALSE),VLOOKUP(Scorekeeping!N33,'Standard Board Scores'!$R:$U,4,FALSE)),\"\")),\"\")=0,\"\",IFERROR(IF(ISERROR(N33),\"\",IF(OR($D$9=\"Vertical\",$D$9=\"Single Letter\"),INDEX('Current Board'!$B$2:$P$16,VLOOKUP(Scorekeeping!N33,'Standard Board Scores'!$R:$U,3,FALSE),VLOOKUP(Scorekeeping!N33,'Standard Board Scores'!$R:$U,4,FALSE)),\"\")),\"\")),\"\")","v":""},{"$f":"IF(N34<>\"\",IF(IFERROR(IF(O33=\"\",\"\",IF(OR($D$9=\"Vertical\",$D$9=\"Single Letter\"),INDEX('Current Board'!$B$2:$P$16,VLOOKUP(Scorekeeping!O33,'Standard Board Scores'!$R:$U,3,FALSE),VLOOKUP(Scorekeeping!O33,'Standard Board Scores'!$R:$U,4,FALSE)),\"\")),\"\")=0,\"\",IFERROR(IF(ISERROR(O33),\"\",IF(OR($D$9=\"Vertical\",$D$9=\"Single Letter\"),INDEX('Current Board'!$B$2:$P$16,VLOOKUP(Scorekeeping!O33,'Standard Board Scores'!$R:$U,3,FALSE),VLOOKUP(Scorekeeping!O33,'Standard Board Scores'!$R:$U,4,FALSE)),\"\")),\"\")),\"\")","v":""},{"$f":"IF(O34<>\"\",IF(IFERROR(IF(P33=\"\",\"\",IF(OR($D$9=\"Vertical\",$D$9=\"Single Letter\"),INDEX('Current Board'!$B$2:$P$16,VLOOKUP(Scorekeeping!P33,'Standard Board Scores'!$R:$U,3,FALSE),VLOOKUP(Scorekeeping!P33,'Standard Board Scores'!$R:$U,4,FALSE)),\"\")),\"\")=0,\"\",IFERROR(IF(ISERROR(P33),\"\",IF(OR($D$9=\"Vertical\",$D$9=\"Single Letter\"),INDEX('Current Board'!$B$2:$P$16,VLOOKUP(Scorekeeping!P33,'Standard Board Scores'!$R:$U,3,FALSE),VLOOKUP(Scorekeeping!P33,'Standard Board Scores'!$R:$U,4,FALSE)),\"\")),\"\")),\"\")","v":""},{"$f":"IF(P34<>\"\",IF(IFERROR(IF(Q33=\"\",\"\",IF(OR($D$9=\"Vertical\",$D$9=\"Single Letter\"),INDEX('Current Board'!$B$2:$P$16,VLOOKUP(Scorekeeping!Q33,'Standard Board Scores'!$R:$U,3,FALSE),VLOOKUP(Scorekeeping!Q33,'Standard Board Scores'!$R:$U,4,FALSE)),\"\")),\"\")=0,\"\",IFERROR(IF(ISERROR(Q33),\"\",IF(OR($D$9=\"Vertical\",$D$9=\"Single Letter\"),INDEX('Current Board'!$B$2:$P$16,VLOOKUP(Scorekeeping!Q33,'Standard Board Scores'!$R:$U,3,FALSE),VLOOKUP(Scorekeeping!Q33,'Standard Board Scores'!$R:$U,4,FALSE)),\"\")),\"\")),\"\")","v":""},{"$f":"IF(Q34<>\"\",IF(IFERROR(IF(R33=\"\",\"\",IF(OR($D$9=\"Vertical\",$D$9=\"Single Letter\"),INDEX('Current Board'!$B$2:$P$16,VLOOKUP(Scorekeeping!R33,'Standard Board Scores'!$R:$U,3,FALSE),VLOOKUP(Scorekeeping!R33,'Standard Board Scores'!$R:$U,4,FALSE)),\"\")),\"\")=0,\"\",IFERROR(IF(ISERROR(R33),\"\",IF(OR($D$9=\"Vertical\",$D$9=\"Single Letter\"),INDEX('Current Board'!$B$2:$P$16,VLOOKUP(Scorekeeping!R33,'Standard Board Scores'!$R:$U,3,FALSE),VLOOKUP(Scorekeeping!R33,'Standard Board Scores'!$R:$U,4,FALSE)),\"\")),\"\")),\"\")","v":""},{"$f":"IF(R34<>\"\",IF(IFERROR(IF(S33=\"\",\"\",IF(OR($D$9=\"Vertical\",$D$9=\"Single Letter\"),INDEX('Current Board'!$B$2:$P$16,VLOOKUP(Scorekeeping!S33,'Standard Board Scores'!$R:$U,3,FALSE),VLOOKUP(Scorekeeping!S33,'Standard Board Scores'!$R:$U,4,FALSE)),\"\")),\"\")=0,\"\",IFERROR(IF(ISERROR(S33),\"\",IF(OR($D$9=\"Vertical\",$D$9=\"Single Letter\"),INDEX('Current Board'!$B$2:$P$16,VLOOKUP(Scorekeeping!S33,'Standard Board Scores'!$R:$U,3,FALSE),VLOOKUP(Scorekeeping!S33,'Standard Board Scores'!$R:$U,4,FALSE)),\"\")),\"\")),\"\")","v":""},{"$f":"IF(S34<>\"\",IF(IFERROR(IF(T33=\"\",\"\",IF(OR($D$9=\"Vertical\",$D$9=\"Single Letter\"),INDEX('Current Board'!$B$2:$P$16,VLOOKUP(Scorekeeping!T33,'Standard Board Scores'!$R:$U,3,FALSE),VLOOKUP(Scorekeeping!T33,'Standard Board Scores'!$R:$U,4,FALSE)),\"\")),\"\")=0,\"\",IFERROR(IF(ISERROR(T33),\"\",IF(OR($D$9=\"Vertical\",$D$9=\"Single Letter\"),INDEX('Current Board'!$B$2:$P$16,VLOOKUP(Scorekeeping!T33,'Standard Board Scores'!$R:$U,3,FALSE),VLOOKUP(Scorekeeping!T33,'Standard Board Scores'!$R:$U,4,FALSE)),\"\")),\"\")),\"\")","v":""},{"$f":"IF(T34<>\"\",IF(IFERROR(IF(U33=\"\",\"\",IF(OR($D$9=\"Vertical\",$D$9=\"Single Letter\"),INDEX('Current Board'!$B$2:$P$16,VLOOKUP(Scorekeeping!U33,'Standard Board Scores'!$R:$U,3,FALSE),VLOOKUP(Scorekeeping!U33,'Standard Board Scores'!$R:$U,4,FALSE)),\"\")),\"\")=0,\"\",IFERROR(IF(ISERROR(U33),\"\",IF(OR($D$9=\"Vertical\",$D$9=\"Single Letter\"),INDEX('Current Board'!$B$2:$P$16,VLOOKUP(Scorekeeping!U33,'Standard Board Scores'!$R:$U,3,FALSE),VLOOKUP(Scorekeeping!U33,'Standard Board Scores'!$R:$U,4,FALSE)),\"\")),\"\")),\"\")","v":""},{"$f":"IF(U34<>\"\",IF(IFERROR(IF(V33=\"\",\"\",IF(OR($D$9=\"Vertical\",$D$9=\"Single Letter\"),INDEX('Current Board'!$B$2:$P$16,VLOOKUP(Scorekeeping!V33,'Standard Board Scores'!$R:$U,3,FALSE),VLOOKUP(Scorekeeping!V33,'Standard Board Scores'!$R:$U,4,FALSE)),\"\")),\"\")=0,\"\",IFERROR(IF(ISERROR(V33),\"\",IF(OR($D$9=\"Vertical\",$D$9=\"Single Letter\"),INDEX('Current Board'!$B$2:$P$16,VLOOKUP(Scorekeeping!V33,'Standard Board Scores'!$R:$U,3,FALSE),VLOOKUP(Scorekeeping!V33,'Standard Board Scores'!$R:$U,4,FALSE)),\"\")),\"\")),\"\")","v":""},{"$f":"IF(V34<>\"\",IF(IFERROR(IF(W33=\"\",\"\",IF(OR($D$9=\"Vertical\",$D$9=\"Single Letter\"),INDEX('Current Board'!$B$2:$P$16,VLOOKUP(Scorekeeping!W33,'Standard Board Scores'!$R:$U,3,FALSE),VLOOKUP(Scorekeeping!W33,'Standard Board Scores'!$R:$U,4,FALSE)),\"\")),\"\")=0,\"\",IFERROR(IF(ISERROR(W33),\"\",IF(OR($D$9=\"Vertical\",$D$9=\"Single Letter\"),INDEX('Current Board'!$B$2:$P$16,VLOOKUP(Scorekeeping!W33,'Standard Board Scores'!$R:$U,3,FALSE),VLOOKUP(Scorekeeping!W33,'Standard Board Scores'!$R:$U,4,FALSE)),\"\")),\"\")),\"\")","v":""},{"$f":"IF(W34<>\"\",IF(IFERROR(IF(X33=\"\",\"\",IF(OR($D$9=\"Vertical\",$D$9=\"Single Letter\"),INDEX('Current Board'!$B$2:$P$16,VLOOKUP(Scorekeeping!X33,'Standard Board Scores'!$R:$U,3,FALSE),VLOOKUP(Scorekeeping!X33,'Standard Board Scores'!$R:$U,4,FALSE)),\"\")),\"\")=0,\"\",IFERROR(IF(ISERROR(X33),\"\",IF(OR($D$9=\"Vertical\",$D$9=\"Single Letter\"),INDEX('Current Board'!$B$2:$P$16,VLOOKUP(Scorekeeping!X33,'Standard Board Scores'!$R:$U,3,FALSE),VLOOKUP(Scorekeeping!X33,'Standard Board Scores'!$R:$U,4,FALSE)),\"\")),\"\")),\"\")","v":""},{"$f":"IF(X34<>\"\",IF(IFERROR(IF(Y33=\"\",\"\",IF(OR($D$9=\"Vertical\",$D$9=\"Single Letter\"),INDEX('Current Board'!$B$2:$P$16,VLOOKUP(Scorekeeping!Y33,'Standard Board Scores'!$R:$U,3,FALSE),VLOOKUP(Scorekeeping!Y33,'Standard Board Scores'!$R:$U,4,FALSE)),\"\")),\"\")=0,\"\",IFERROR(IF(ISERROR(Y33),\"\",IF(OR($D$9=\"Vertical\",$D$9=\"Single Letter\"),INDEX('Current Board'!$B$2:$P$16,VLOOKUP(Scorekeeping!Y33,'Standard Board Scores'!$R:$U,3,FALSE),VLOOKUP(Scorekeeping!Y33,'Standard Board Scores'!$R:$U,4,FALSE)),\"\")),\"\")),\"\")","v":""}]
[null,null,null,{"$f":"IF(IFERROR(IF(ISERROR(D$5),\"\",IF(OR($D$10=\"Horizontal\",$D$10=\"Single Letter\"),INDEX('Current Board'!$B$2:$P$16,VLOOKUP(Scorekeeping!D34,'Standard Board Scores'!$R:$U,3,FALSE),VLOOKUP(Scorekeeping!D34,'Standard Board Scores'!$R:$U,4,FALSE)),\"\")),\"\")=0,\"\",IFERROR(IF(ISERROR(D$5),\"\",IF(OR($D$10=\"Horizontal\",$D$10=\"Single Letter\"),INDEX('Current Board'!$B$2:$P$16,VLOOKUP(Scorekeeping!D34,'Standard Board Scores'!$R:$U,3,FALSE),VLOOKUP(Scorekeeping!D34,'Standard Board Scores'!$R:$U,4,FALSE)),\"\")),\"\"))","v":""},{"$f":"IF(IFERROR(IF(ISERROR(E$5),\"\",IF(OR($D$10=\"Horizontal\",$D$10=\"Single Letter\"),INDEX('Current Board'!$B$2:$P$16,VLOOKUP(Scorekeeping!E34,'Standard Board Scores'!$R:$U,3,FALSE),VLOOKUP(Scorekeeping!E34,'Standard Board Scores'!$R:$U,4,FALSE)),\"\")),\"\")=0,\"\",IFERROR(IF(ISERROR(E$5),\"\",IF(OR($D$10=\"Horizontal\",$D$10=\"Single Letter\"),INDEX('Current Board'!$B$2:$P$16,VLOOKUP(Scorekeeping!E34,'Standard Board Scores'!$R:$U,3,FALSE),VLOOKUP(Scorekeeping!E34,'Standard Board Scores'!$R:$U,4,FALSE)),\"\")),\"\"))","v":""},{"$f":"IF(IFERROR(IF(ISERROR(F$5),\"\",IF(OR($D$10=\"Horizontal\",$D$10=\"Single Letter\"),INDEX('Current Board'!$B$2:$P$16,VLOOKUP(Scorekeeping!F34,'Standard Board Scores'!$R:$U,3,FALSE),VLOOKUP(Scorekeeping!F34,'Standard Board Scores'!$R:$U,4,FALSE)),\"\")),\"\")=0,\"\",IFERROR(IF(ISERROR(F$5),\"\",IF(OR($D$10=\"Horizontal\",$D$10=\"Single Letter\"),INDEX('Current Board'!$B$2:$P$16,VLOOKUP(Scorekeeping!F34,'Standard Board Scores'!$R:$U,3,FALSE),VLOOKUP(Scorekeeping!F34,'Standard Board Scores'!$R:$U,4,FALSE)),\"\")),\"\"))","v":""},{"$f":"IF(IFERROR(IF(ISERROR(G$5),\"\",IF(OR($D$10=\"Horizontal\",$D$10=\"Single Letter\"),INDEX('Current Board'!$B$2:$P$16,VLOOKUP(Scorekeeping!G34,'Standard Board Scores'!$R:$U,3,FALSE),VLOOKUP(Scorekeeping!G34,'Standard Board Scores'!$R:$U,4,FALSE)),\"\")),\"\")=0,\"\",IFERROR(IF(ISERROR(G$5),\"\",IF(OR($D$10=\"Horizontal\",$D$10=\"Single Letter\"),INDEX('Current Board'!$B$2:$P$16,VLOOKUP(Scorekeeping!G34,'Standard Board Scores'!$R:$U,3,FALSE),VLOOKUP(Scorekeeping!G34,'Standard Board Scores'!$R:$U,4,FALSE)),\"\")),\"\"))","v":""},{"$f":"IF(IFERROR(IF(ISERROR(H$5),\"\",IF(OR($D$10=\"Horizontal\",$D$10=\"Single Letter\"),INDEX('Current Board'!$B$2:$P$16,VLOOKUP(Scorekeeping!H34,'Standard Board Scores'!$R:$U,3,FALSE),VLOOKUP(Scorekeeping!H34,'Standard Board Scores'!$R:$U,4,FALSE)),\"\")),\"\")=0,\"\",IFERROR(IF(ISERROR(H$5),\"\",IF(OR($D$10=\"Horizontal\",$D$10=\"Single Letter\"),INDEX('Current Board'!$B$2:$P$16,VLOOKUP(Scorekeeping!H34,'Standard Board Scores'!$R:$U,3,FALSE),VLOOKUP(Scorekeeping!H34,'Standard Board Scores'!$R:$U,4,FALSE)),\"\")),\"\"))","v":""},{"$f":"IF(IFERROR(IF(ISERROR(I$5),\"\",IF(OR($D$10=\"Horizontal\",$D$10=\"Single Letter\"),INDEX('Current Board'!$B$2:$P$16,VLOOKUP(Scorekeeping!I34,'Standard Board Scores'!$R:$U,3,FALSE),VLOOKUP(Scorekeeping!I34,'Standard Board Scores'!$R:$U,4,FALSE)),\"\")),\"\")=0,\"\",IFERROR(IF(ISERROR(I$5),\"\",IF(OR($D$10=\"Horizontal\",$D$10=\"Single Letter\"),INDEX('Current Board'!$B$2:$P$16,VLOOKUP(Scorekeeping!I34,'Standard Board Scores'!$R:$U,3,FALSE),VLOOKUP(Scorekeeping!I34,'Standard Board Scores'!$R:$U,4,FALSE)),\"\")),\"\"))","v":""},{"$f":"IF(IFERROR(IF(ISERROR(J$5),\"\",IF(OR($D$10=\"Horizontal\",$D$10=\"Single Letter\"),INDEX('Current Board'!$B$2:$P$16,VLOOKUP(Scorekeeping!J34,'Standard Board Scores'!$R:$U,3,FALSE),VLOOKUP(Scorekeeping!J34,'Standard Board Scores'!$R:$U,4,FALSE)),\"\")),\"\")=0,\"\",IFERROR(IF(ISERROR(J$5),\"\",IF(OR($D$10=\"Horizontal\",$D$10=\"Single Letter\"),INDEX('Current Board'!$B$2:$P$16,VLOOKUP(Scorekeeping!J34,'Standard Board Scores'!$R:$U,3,FALSE),VLOOKUP(Scorekeeping!J34,'Standard Board Scores'!$R:$U,4,FALSE)),\"\")),\"\"))","v":""},{"$f":"IFERROR(VLOOKUP(K34,'Tiles Remaining'!$A:$C,3,FALSE),\"\")","v":""},{"$f":"IFERROR(VLOOKUP(L34,'Tiles Remaining'!$A:$C,3,FALSE),\"\")","v":""},{"$f":"IFERROR(VLOOKUP(M34,'Tiles Remaining'!$A:$C,3,FALSE),\"\")","v":""},{"$f":"IFERROR(VLOOKUP(N34,'Tiles Remaining'!$A:$C,3,FALSE),\"\")","v":""},{"$f":"IFERROR(VLOOKUP(O34,'Tiles Remaining'!$A:$C,3,FALSE),\"\")","v":""},{"$f":"IFERROR(VLOOKUP(P34,'Tiles Remaining'!$A:$C,3,FALSE),\"\")","v":""},{"$f":"IFERROR(VLOOKUP(Q34,'Tiles Remaining'!$A:$C,3,FALSE),\"\")","v":""},{"$f":"IFERROR(VLOOKUP(R34,'Tiles Remaining'!$A:$C,3,FALSE),\"\")","v":""},{"$f":"IFERROR(VLOOKUP(S34,'Tiles Remaining'!$A:$C,3,FALSE),\"\")","v":""},{"$f":"IFERROR(VLOOKUP(T34,'Tiles Remaining'!$A:$C,3,FALSE),\"\")","v":""},{"$f":"IFERROR(VLOOKUP(U34,'Tiles Remaining'!$A:$C,3,FALSE),\"\")","v":""},{"$f":"IFERROR(VLOOKUP(V34,'Tiles Remaining'!$A:$C,3,FALSE),\"\")","v":""},{"$f":"IFERROR(VLOOKUP(W34,'Tiles Remaining'!$A:$C,3,FALSE),\"\")","v":""},{"$f":"IFERROR(VLOOKUP(X34,'Tiles Remaining'!$A:$C,3,FALSE),\"\")","v":""},{"$f":"IFERROR(VLOOKUP(Y34,'Tiles Remaining'!$A:$C,3,FALSE),\"\")","v":""},{"$f":"SUM(K35:Y35)","v":0}]
[null,"Secondary Words",{"$f":"IF(D10=\"\",\"\",IF(D10=\"Vertical\",IF(AND(D17=\"\",E17=\"\",F17=\"\",G17=\"\",H17=\"\",I17=\"\",J17=\"\",D19=\"\",E19=\"\",F19=\"\",G19=\"\",H19=\"\",I19=\"\",J19=\"\"),\"No\",\"Yes - Vertical\"),IF(D10=\"Horizontal\",IF(AND(D27=\"\",E27=\"\",F27=\"\",G27=\"\",H27=\"\",I27=\"\",J27=\"\",D29=\"\",E29=\"\",F29=\"\",G29=\"\",H29=\"\",I29=\"\",J29=\"\"),\"No\",\"Yes - Horizontal\"),IF(D10=\"Single Letter\",IF(AND(D17=\"\",E17=\"\",F17=\"\",G17=\"\",H17=\"\",I17=\"\",J17=\"\",D19=\"\",E19=\"\",F19=\"\",G19=\"\",H19=\"\",I19=\"\",J19=\"\",D27=\"\",E27=\"\",F27=\"\",G27=\"\",H27=\"\",I27=\"\",J27=\"\",D29=\"\",E29=\"\",F29=\"\",G29=\"\",H29=\"\",I29=\"\",J29=\"\"),\"No\",\"Yes - Single Letter\")))))","v":""},null,{"$f":"IF(IFERROR(IF(ISERROR(E$5),\"\",IF(OR($D$10=\"Vertical\",$D$10=\"Single Letter\"),INDEX('Current Board'!$B$2:$P$16,VLOOKUP(Scorekeeping!E35,'Standard Board Scores'!$R:$U,3,FALSE),VLOOKUP(Scorekeeping!E35,'Standard Board Scores'!$R:$U,4,FALSE)),\"\")),\"\")=0,\"\",IFERROR(IF(ISERROR(E$5),\"\",IF(OR($D$10=\"Vertical\",$D$10=\"Single Letter\"),INDEX('Current Board'!$B$2:$P$16,VLOOKUP(Scorekeeping!E35,'Standard Board Scores'!$R:$U,3,FALSE),VLOOKUP(Scorekeeping!E35,'Standard Board Scores'!$R:$U,4,FALSE)),\"\")),\"\"))","v":""},{"$f":"IF(IFERROR(IF(ISERROR(F$5),\"\",IF(OR($D$10=\"Vertical\",$D$10=\"Single Letter\"),INDEX('Current Board'!$B$2:$P$16,VLOOKUP(Scorekeeping!F35,'Standard Board Scores'!$R:$U,3,FALSE),VLOOKUP(Scorekeeping!F35,'Standard Board Scores'!$R:$U,4,FALSE)),\"\")),\"\")=0,\"\",IFERROR(IF(ISERROR(F$5),\"\",IF(OR($D$10=\"Vertical\",$D$10=\"Single Letter\"),INDEX('Current Board'!$B$2:$P$16,VLOOKUP(Scorekeeping!F35,'Standard Board Scores'!$R:$U,3,FALSE),VLOOKUP(Scorekeeping!F35,'Standard Board Scores'!$R:$U,4,FALSE)),\"\")),\"\"))","v":""},{"$f":"IF(IFERROR(IF(ISERROR(G$5),\"\",IF(OR($D$10=\"Vertical\",$D$10=\"Single Letter\"),INDEX('Current Board'!$B$2:$P$16,VLOOKUP(Scorekeeping!G35,'Standard Board Scores'!$R:$U,3,FALSE),VLOOKUP(Scorekeeping!G35,'Standard Board Scores'!$R:$U,4,FALSE)),\"\")),\"\")=0,\"\",IFERROR(IF(ISERROR(G$5),\"\",IF(OR($D$10=\"Vertical\",$D$10=\"Single Letter\"),INDEX('Current Board'!$B$2:$P$16,VLOOKUP(Scorekeeping!G35,'Standard Board Scores'!$R:$U,3,FALSE),VLOOKUP(Scorekeeping!G35,'Standard Board Scores'!$R:$U,4,FALSE)),\"\")),\"\"))","v":""},{"$f":"IF(IFERROR(IF(ISERROR(H$5),\"\",IF(OR($D$10=\"Vertical\",$D$10=\"Single Letter\"),INDEX('Current Board'!$B$2:$P$16,VLOOKUP(Scorekeeping!H35,'Standard Board Scores'!$R:$U,3,FALSE),VLOOKUP(Scorekeeping!H35,'Standard Board Scores'!$R:$U,4,FALSE)),\"\")),\"\")=0,\"\",IFERROR(IF(ISERROR(H$5),\"\",IF(OR($D$10=\"Vertical\",$D$10=\"Single Letter\"),INDEX('Current Board'!$B$2:$P$16,VLOOKUP(Scorekeeping!H35,'Standard Board Scores'!$R:$U,3,FALSE),VLOOKUP(Scorekeeping!H35,'Standard Board Scores'!$R:$U,4,FALSE)),\"\")),\"\"))","v":""},{"$f":"IF(IFERROR(IF(ISERROR(I$5),\"\",IF(OR($D$10=\"Vertical\",$D$10=\"Single Letter\"),INDEX('Current Board'!$B$2:$P$16,VLOOKUP(Scorekeeping!I35,'Standard Board Scores'!$R:$U,3,FALSE),VLOOKUP(Scorekeeping!I35,'Standard Board Scores'!$R:$U,4,FALSE)),\"\")),\"\")=0,\"\",IFERROR(IF(ISERROR(I$5),\"\",IF(OR($D$10=\"Vertical\",$D$10=\"Single Letter\"),INDEX('Current Board'!$B$2:$P$16,VLOOKUP(Scorekeeping!I35,'Standard Board Scores'!$R:$U,3,FALSE),VLOOKUP(Scorekeeping!I35,'Standard Board Scores'!$R:$U,4,FALSE)),\"\")),\"\"))","v":""},{"$f":"IF(IFERROR(IF(ISERROR(J$5),\"\",IF(OR($D$10=\"Vertical\",$D$10=\"Single Letter\"),INDEX('Current Board'!$B$2:$P$16,VLOOKUP(Scorekeeping!J35,'Standard Board Scores'!$R:$U,3,FALSE),VLOOKUP(Scorekeeping!J35,'Standard Board Scores'!$R:$U,4,FALSE)),\"\")),\"\")=0,\"\",IFERROR(IF(ISERROR(J$5),\"\",IF(OR($D$10=\"Vertical\",$D$10=\"Single Letter\"),INDEX('Current Board'!$B$2:$P$16,VLOOKUP(Scorekeeping!J35,'Standard Board Scores'!$R:$U,3,FALSE),VLOOKUP(Scorekeeping!J35,'Standard Board Scores'!$R:$U,4,FALSE)),\"\")),\"\"))","v":""},null,"Vertical 5 - Side A"]
[null,null,null,null,null,null,null,null,null,null,null,1,2,3,4,5,6,7,8,9,10,11,12,13,14]
[null,"TOTAL",{"$f":"IF(J2=\"\",IF(C36=\"Yes - Vertical\",SUM(D14,D21:J21,AA85),IF(C36=\"Yes - Horizontal\",SUM(D14,D31:J31,AA165),IF(C36=\"Yes - Single Letter\",SUM(D14,AA85,AA165),D14))),SUM(50,IF(C36=\"Yes - Vertical\",SUM(D14,D21:J21,AA85),IF(C36=\"Yes - Horizontal\",SUM(D14,D31:J31,AA165),IF(C36=\"Yes - Single Letter\",SUM(D14,AA85,AA165),D14)))))","v":""},null,null,null,null,null,null,null,{"$f":"H16","v":""},{"$f":"IF(AND(K38<>\"\",LEFT(K38,1)<>\"B\",LEFT(K38,1)<>\"A\"),CONCATENATE(CHAR(CODE(LEFT(K38,1))-1),REPLACE(K38,1,1,\"\")),\"\")","v":""},{"$f":"IF(AND(L38<>\"\",LEFT(L38,1)<>\"B\",LEFT(L38,1)<>\"A\"),CONCATENATE(CHAR(CODE(LEFT(L38,1))-1),REPLACE(L38,1,1,\"\")),\"\")","v":""},"","","","","","","","","","","",""]
[null,null,null,null,null,null,null,null,null,null,{"$f":"IF(IFERROR(IF(K38=\"\",\"\",IF(OR($D$9=\"Vertical\",$D$9=\"Single Letter\"),INDEX('Current Board'!$B$2:$P$16,VLOOKUP(Scorekeeping!K38,'Standard Board Scores'!$R:$U,3,FALSE),VLOOKUP(Scorekeeping!K38,'Standard Board Scores'!$R:$U,4,FALSE)),\"\")),\"\")=0,\"\",IFERROR(IF(ISERROR(K38),\"\",IF(OR($D$9=\"Vertical\",$D$9=\"Single Letter\"),INDEX('Current Board'!$B$2:$P$16,VLOOKUP(Scorekeeping!K38,'Standard Board Scores'!$R:$U,3,FALSE),VLOOKUP(Scorekeeping!K38,'Standard Board Scores'!$R:$U,4,FALSE)),\"\")),\"\"))","v":""},{"$f":"IF(K39<>\"\",IF(IFERROR(IF(L38=\"\",\"\",IF(OR($D$9=\"Vertical\",$D$9=\"Single Letter\"),INDEX('Current Board'!$B$2:$P$16,VLOOKUP(Scorekeeping!L38,'Standard Board Scores'!$R:$U,3,FALSE),VLOOKUP(Scorekeeping!L38,'Standard Board Scores'!$R:$U,4,FALSE)),\"\")),\"\")=0,\"\",IFERROR(IF(ISERROR(L38),\"\",IF(OR($D$9=\"Vertical\",$D$9=\"Single Letter\"),INDEX('Current Board'!$B$2:$P$16,VLOOKUP(Scorekeeping!L38,'Standard Board Scores'!$R:$U,3,FALSE),VLOOKUP(Scorekeeping!L38,'Standard Board Scores'!$R:$U,4,FALSE)),\"\")),\"\")),\"\")","v":""},{"$f":"IF(L39<>\"\",IF(IFERROR(IF(M38=\"\",\"\",IF(OR($D$9=\"Vertical\",$D$9=\"Single Letter\"),INDEX('Current Board'!$B$2:$P$16,VLOOKUP(Scorekeeping!M38,'Standard Board Scores'!$R:$U,3,FALSE),VLOOKUP(Scorekeeping!M38,'Standard Board Scores'!$R:$U,4,FALSE)),\"\")),\"\")=0,\"\",IFERROR(IF(ISERROR(M38),\"\",IF(OR($D$9=\"Vertical\",$D$9=\"Single Letter\"),INDEX('Current Board'!$B$2:$P$16,VLOOKUP(Scorekeeping!M38,'Standard Board Scores'!$R:$U,3,FALSE),VLOOKUP(Scorekeeping!M38,'Standard Board Scores'!$R:$U,4,FALSE)),\"\")),\"\")),\"\")","v":""},{"$f":"IF(M39<>\"\",IF(IFERROR(IF(N38=\"\",\"\",IF(OR($D$9=\"Vertical\",$D$9=\"Single Letter\"),INDEX('Current Board'!$B$2:$P$16,VLOOKUP(Scorekeeping!N38,'Standard Board Scores'!$R:$U,3,FALSE),VLOOKUP(Scorekeeping!N38,'Standard Board Scores'!$R:$U,4,FALSE)),\"\")),\"\")=0,\"\",IFERROR(IF(ISERROR(N38),\"\",IF(OR($D$9=\"Vertical\",$D$9=\"Single Letter\"),INDEX('Current Board'!$B$2:$P$16,VLOOKUP(Scorekeeping!N38,'Standard Board Scores'!$R:$U,3,FALSE),VLOOKUP(Scorekeeping!N38,'Standard Board Scores'!$R:$U,4,FALSE)),\"\")),\"\")),\"\")","v":""},{"$f":"IF(N39<>\"\",IF(IFERROR(IF(O38=\"\",\"\",IF(OR($D$9=\"Vertical\",$D$9=\"Single Letter\"),INDEX('Current Board'!$B$2:$P$16,VLOOKUP(Scorekeeping!O38,'Standard Board Scores'!$R:$U,3,FALSE),VLOOKUP(Scorekeeping!O38,'Standard Board Scores'!$R:$U,4,FALSE)),\"\")),\"\")=0,\"\",IFERROR(IF(ISERROR(O38),\"\",IF(OR($D$9=\"Vertical\",$D$9=\"Single Letter\"),INDEX('Current Board'!$B$2:$P$16,VLOOKUP(Scorekeeping!O38,'Standard Board Scores'!$R:$U,3,FALSE),VLOOKUP(Scorekeeping!O38,'Standard Board Scores'!$R:$U,4,FALSE)),\"\")),\"\")),\"\")","v":""},{"$f":"IF(O39<>\"\",IF(IFERROR(IF(P38=\"\",\"\",IF(OR($D$9=\"Vertical\",$D$9=\"Single Letter\"),INDEX('Current Board'!$B$2:$P$16,VLOOKUP(Scorekeeping!P38,'Standard Board Scores'!$R:$U,3,FALSE),VLOOKUP(Scorekeeping!P38,'Standard Board Scores'!$R:$U,4,FALSE)),\"\")),\"\")=0,\"\",IFERROR(IF(ISERROR(P38),\"\",IF(OR($D$9=\"Vertical\",$D$9=\"Single Letter\"),INDEX('Current Board'!$B$2:$P$16,VLOOKUP(Scorekeeping!P38,'Standard Board Scores'!$R:$U,3,FALSE),VLOOKUP(Scorekeeping!P38,'Standard Board Scores'!$R:$U,4,FALSE)),\"\")),\"\")),\"\")","v":""},{"$f":"IF(P39<>\"\",IF(IFERROR(IF(Q38=\"\",\"\",IF(OR($D$9=\"Vertical\",$D$9=\"Single Letter\"),INDEX('Current Board'!$B$2:$P$16,VLOOKUP(Scorekeeping!Q38,'Standard Board Scores'!$R:$U,3,FALSE),VLOOKUP(Scorekeeping!Q38,'Standard Board Scores'!$R:$U,4,FALSE)),\"\")),\"\")=0,\"\",IFERROR(IF(ISERROR(Q38),\"\",IF(OR($D$9=\"Vertical\",$D$9=\"Single Letter\"),INDEX('Current Board'!$B$2:$P$16,VLOOKUP(Scorekeeping!Q38,'Standard Board Scores'!$R:$U,3,FALSE),VLOOKUP(Scorekeeping!Q38,'Standard Board Scores'!$R:$U,4,FALSE)),\"\")),\"\")),\"\")","v":""},{"$f":"IF(Q39<>\"\",IF(IFERROR(IF(R38=\"\",\"\",IF(OR($D$9=\"Vertical\",$D$9=\"Single Letter\"),INDEX('Current Board'!$B$2:$P$16,VLOOKUP(Scorekeeping!R38,'Standard Board Scores'!$R:$U,3,FALSE),VLOOKUP(Scorekeeping!R38,'Standard Board Scores'!$R:$U,4,FALSE)),\"\")),\"\")=0,\"\",IFERROR(IF(ISERROR(R38),\"\",IF(OR($D$9=\"Vertical\",$D$9=\"Single Letter\"),INDEX('Current Board'!$B$2:$P$16,VLOOKUP(Scorekeeping!R38,'Standard Board Scores'!$R:$U,3,FALSE),VLOOKUP(Scorekeeping!R38,'Standard Board Scores'!$R:$U,4,FALSE)),\"\")),\"\")),\"\")","v":""},{"$f":"IF(R39<>\"\",IF(IFERROR(IF(S38=\"\",\"\",IF(OR($D$9=\"Vertical\",$D$9=\"Single Letter\"),INDEX('Current Board'!$B$2:$P$16,VLOOKUP(Scorekeeping!S38,'Standard Board Scores'!$R:$U,3,FALSE),VLOOKUP(Scorekeeping!S38,'Standard Board Scores'!$R:$U,4,FALSE)),\"\")),\"\")=0,\"\",IFERROR(IF(ISERROR(S38),\"\",IF(OR($D$9=\"Vertical\",$D$9=\"Single Letter\"),INDEX('Current Board'!$B$2:$P$16,VLOOKUP(Scorekeeping!S38,'Standard Board Scores'!$R:$U,3,FALSE),VLOOKUP(Scorekeeping!S38,'Standard Board Scores'!$R:$U,4,FALSE)),\"\")),\"\")),\"\")","v":""},{"$f":"IF(S39<>\"\",IF(IFERROR(IF(T38=\"\",\"\",IF(OR($D$9=\"Vertical\",$D$9=\"Single Letter\"),INDEX('Current Board'!$B$2:$P$16,VLOOKUP(Scorekeeping!T38,'Standard Board Scores'!$R:$U,3,FALSE),VLOOKUP(Scorekeeping!T38,'Standard Board Scores'!$R:$U,4,FALSE)),\"\")),\"\")=0,\"\",IFERROR(IF(ISERROR(T38),\"\",IF(OR($D$9=\"Vertical\",$D$9=\"Single Letter\"),INDEX('Current Board'!$B$2:$P$16,VLOOKUP(Scorekeeping!T38,'Standard Board Scores'!$R:$U,3,FALSE),VLOOKUP(Scorekeeping!T38,'Standard Board Scores'!$R:$U,4,FALSE)),\"\")),\"\")),\"\")","v":""},{"$f":"IF(T39<>\"\",IF(IFERROR(IF(U38=\"\",\"\",IF(OR($D$9=\"Vertical\",$D$9=\"Single Letter\"),INDEX('Current Board'!$B$2:$P$16,VLOOKUP(Scorekeeping!U38,'Standard Board Scores'!$R:$U,3,FALSE),VLOOKUP(Scorekeeping!U38,'Standard Board Scores'!$R:$U,4,FALSE)),\"\")),\"\")=0,\"\",IFERROR(IF(ISERROR(U38),\"\",IF(OR($D$9=\"Vertical\",$D$9=\"Single Letter\"),INDEX('Current Board'!$B$2:$P$16,VLOOKUP(Scorekeeping!U38,'Standard Board Scores'!$R:$U,3,FALSE),VLOOKUP(Scorekeeping!U38,'Standard Board Scores'!$R:$U,4,FALSE)),\"\")),\"\")),\"\")","v":""},{"$f":"IF(U39<>\"\",IF(IFERROR(IF(V38=\"\",\"\",IF(OR($D$9=\"Vertical\",$D$9=\"Single Letter\"),INDEX('Current Board'!$B$2:$P$16,VLOOKUP(Scorekeeping!V38,'Standard Board Scores'!$R:$U,3,FALSE),VLOOKUP(Scorekeeping!V38,'Standard Board Scores'!$R:$U,4,FALSE)),\"\")),\"\")=0,\"\",IFERROR(IF(ISERROR(V38),\"\",IF(OR($D$9=\"Vertical\",$D$9=\"Single Letter\"),INDEX('Current Board'!$B$2:$P$16,VLOOKUP(Scorekeeping!V38,'Standard Board Scores'!$R:$U,3,FALSE),VLOOKUP(Scorekeeping!V38,'Standard Board Scores'!$R:$U,4,FALSE)),\"\")),\"\")),\"\")","v":""},{"$f":"IF(V39<>\"\",IF(IFERROR(IF(W38=\"\",\"\",IF(OR($D$9=\"Vertical\",$D$9=\"Single Letter\"),INDEX('Current Board'!$B$2:$P$16,VLOOKUP(Scorekeeping!W38,'Standard Board Scores'!$R:$U,3,FALSE),VLOOKUP(Scorekeeping!W38,'Standard Board Scores'!$R:$U,4,FALSE)),\"\")),\"\")=0,\"\",IFERROR(IF(ISERROR(W38),\"\",IF(OR($D$9=\"Vertical\",$D$9=\"Single Letter\"),INDEX('Current Board'!$B$2:$P$16,VLOOKUP(Scorekeeping!W38,'Standard Board Scores'!$R:$U,3,FALSE),VLOOKUP(Scorekeeping!W38,'Standard Board Scores'!$R:$U,4,FALSE)),\"\")),\"\")),\"\")","v":""},{"$f":"IF(W39<>\"\",IF(IFERROR(IF(X38=\"\",\"\",IF(OR($D$9=\"Vertical\",$D$9=\"Single Letter\"),INDEX('Current Board'!$B$2:$P$16,VLOOKUP(Scorekeeping!X38,'Standard Board Scores'!$R:$U,3,FALSE),VLOOKUP(Scorekeeping!X38,'Standard Board Scores'!$R:$U,4,FALSE)),\"\")),\"\")=0,\"\",IFERROR(IF(ISERROR(X38),\"\",IF(OR($D$9=\"Vertical\",$D$9=\"Single Letter\"),INDEX('Current Board'!$B$2:$P$16,VLOOKUP(Scorekeeping!X38,'Standard Board Scores'!$R:$U,3,FALSE),VLOOKUP(Scorekeeping!X38,'Standard Board Scores'!$R:$U,4,FALSE)),\"\")),\"\")),\"\")","v":""},{"$f":"IF(X39<>\"\",IF(IFERROR(IF(Y38=\"\",\"\",IF(OR($D$9=\"Vertical\",$D$9=\"Single Letter\"),INDEX('Current Board'!$B$2:$P$16,VLOOKUP(Scorekeeping!Y38,'Standard Board Scores'!$R:$U,3,FALSE),VLOOKUP(Scorekeeping!Y38,'Standard Board Scores'!$R:$U,4,FALSE)),\"\")),\"\")=0,\"\",IFERROR(IF(ISERROR(Y38),\"\",IF(OR($D$9=\"Vertical\",$D$9=\"Single Letter\"),INDEX('Current Board'!$B$2:$P$16,VLOOKUP(Scorekeeping!Y38,'Standard Board Scores'!$R:$U,3,FALSE),VLOOKUP(Scorekeeping!Y38,'Standard Board Scores'!$R:$U,4,FALSE)),\"\")),\"\")),\"\")","v":""}]
[null,null,null,null,null,null,null,null,null,null,{"$f":"IFERROR(VLOOKUP(K39,'Tiles Remaining'!$A:$C,3,FALSE),\"\")","v":""},{"$f":"IFERROR(VLOOKUP(L39,'Tiles Remaining'!$A:$C,3,FALSE),\"\")","v":""},{"$f":"IFERROR(VLOOKUP(M39,'Tiles Remaining'!$A:$C,3,FALSE),\"\")","v":""},{"$f":"IFERROR(VLOOKUP(N39,'Tiles Remaining'!$A:$C,3,FALSE),\"\")","v":""},{"$f":"IFERROR(VLOOKUP(O39,'Tiles Remaining'!$A:$C,3,FALSE),\"\")","v":""},{"$f":"IFERROR(VLOOKUP(P39,'Tiles Remaining'!$A:$C,3,FALSE),\"\")","v":""},{"$f":"IFERROR(VLOOKUP(Q39,'Tiles Remaining'!$A:$C,3,FALSE),\"\")","v":""},{"$f":"IFERROR(VLOOKUP(R39,'Tiles Remaining'!$A:$C,3,FALSE),\"\")","v":""},{"$f":"IFERROR(VLOOKUP(S39,'Tiles Remaining'!$A:$C,3,FALSE),\"\")","v":""},{"$f":"IFERROR(VLOOKUP(T39,'Tiles Remaining'!$A:$C,3,FALSE),\"\")","v":""},{"$f":"IFERROR(VLOOKUP(U39,'Tiles Remaining'!$A:$C,3,FALSE),\"\")","v":""},{"$f":"IFERROR(VLOOKUP(V39,'Tiles Remaining'!$A:$C,3,FALSE),\"\")","v":""},{"$f":"IFERROR(VLOOKUP(W39,'Tiles Remaining'!$A:$C,3,FALSE),\"\")","v":""},{"$f":"IFERROR(VLOOKUP(X39,'Tiles Remaining'!$A:$C,3,FALSE),\"\")","v":""},{"$f":"IFERROR(VLOOKUP(Y39,'Tiles Remaining'!$A:$C,3,FALSE),\"\")","v":""},{"$f":"SUM(K40:Y40)","v":0}]
[null,null,null,null,null,null,null,null,null,null,null,"Vertical 6 - Side A"]
[null,null,null,null,null,null,null,null,null,null,null,1,2,3,4,5,6,7,8,9,10,11,12,13,14]
[null,null,null,null,null,null,null,null,null,null,{"$f":"I16","v":""},{"$f":"IF(AND(K43<>\"\",LEFT(K43,1)<>\"B\",LEFT(K43,1)<>\"A\"),CONCATENATE(CHAR(CODE(LEFT(K43,1))-1),REPLACE(K43,1,1,\"\")),\"\")","v":""},{"$f":"IF(AND(L43<>\"\",LEFT(L43,1)<>\"B\",LEFT(L43,1)<>\"A\"),CONCATENATE(CHAR(CODE(LEFT(L43,1))-1),REPLACE(L43,1,1,\"\")),\"\")","v":""},"","","","","","","","","","","",""]
[null,null,null,null,null,null,null,null,null,null,{"$f":"IF(IFERROR(IF(K43=\"\",\"\",IF(OR($D$9=\"Vertical\",$D$9=\"Single Letter\"),INDEX('Current Board'!$B$2:$P$16,VLOOKUP(Scorekeeping!K43,'Standard Board Scores'!$R:$U,3,FALSE),VLOOKUP(Scorekeeping!K43,'Standard Board Scores'!$R:$U,4,FALSE)),\"\")),\"\")=0,\"\",IFERROR(IF(ISERROR(K43),\"\",IF(OR($D$9=\"Vertical\",$D$9=\"Single Letter\"),INDEX('Current Board'!$B$2:$P$16,VLOOKUP(Scorekeeping!K43,'Standard Board Scores'!$R:$U,3,FALSE),VLOOKUP(Scorekeeping!K43,'Standard Board Scores'!$R:$U,4,FALSE)),\"\")),\"\"))","v":""},{"$f":"IF(K44<>\"\",IF(IFERROR(IF(L43=\"\",\"\",IF(OR($D$9=\"Vertical\",$D$9=\"Single Letter\"),INDEX('Current Board'!$B$2:$P$16,VLOOKUP(Scorekeeping!L43,'Standard Board Scores'!$R:$U,3,FALSE),VLOOKUP(Scorekeeping!L43,'Standard Board Scores'!$R:$U,4,FALSE)),\"\")),\"\")=0,\"\",IFERROR(IF(ISERROR(L43),\"\",IF(OR($D$9=\"Vertical\",$D$9=\"Single Letter\"),INDEX('Current Board'!$B$2:$P$16,VLOOKUP(Scorekeeping!L43,'Standard Board Scores'!$R:$U,3,FALSE),VLOOKUP(Scorekeeping!L43,'Standard Board Scores'!$R:$U,4,FALSE)),\"\")),\"\")),\"\")","v":""},{"$f":"IF(L44<>\"\",IF(IFERROR(IF(M43=\"\",\"\",IF(OR($D$9=\"Vertical\",$D$9=\"Single Letter\"),INDEX('Current Board'!$B$2:$P$16,VLOOKUP(Scorekeeping!M43,'Standard Board Scores'!$R:$U,3,FALSE),VLOOKUP(Scorekeeping!M43,'Standard Board Scores'!$R:$U,4,FALSE)),\"\")),\"\")=0,\"\",IFERROR(IF(ISERROR(M43),\"\",IF(OR($D$9=\"Vertical\",$D$9=\"Single Letter\"),INDEX('Current Board'!$B$2:$P$16,VLOOKUP(Scorekeeping!M43,'Standard Board Scores'!$R:$U,3,FALSE),VLOOKUP(Scorekeeping!M43,'Standard Board Scores'!$R:$U,4,FALSE)),\"\")),\"\")),\"\")","v":""},{"$f":"IF(M44<>\"\",IF(IFERROR(IF(N43=\"\",\"\",IF(OR($D$9=\"Vertical\",$D$9=\"Single Letter\"),INDEX('Current Board'!$B$2:$P$16,VLOOKUP(Scorekeeping!N43,'Standard Board Scores'!$R:$U,3,FALSE),VLOOKUP(Scorekeeping!N43,'Standard Board Scores'!$R:$U,4,FALSE)),\"\")),\"\")=0,\"\",IFERROR(IF(ISERROR(N43),\"\",IF(OR($D$9=\"Vertical\",$D$9=\"Single Letter\"),INDEX('Current Board'!$B$2:$P$16,VLOOKUP(Scorekeeping!N43,'Standard Board Scores'!$R:$U,3,FALSE),VLOOKUP(Scorekeeping!N43,'Standard Board Scores'!$R:$U,4,FALSE)),\"\")),\"\")),\"\")","v":""},{"$f":"IF(N44<>\"\",IF(IFERROR(IF(O43=\"\",\"\",IF(OR($D$9=\"Vertical\",$D$9=\"Single Letter\"),INDEX('Current Board'!$B$2:$P$16,VLOOKUP(Scorekeeping!O43,'Standard Board Scores'!$R:$U,3,FALSE),VLOOKUP(Scorekeeping!O43,'Standard Board Scores'!$R:$U,4,FALSE)),\"\")),\"\")=0,\"\",IFERROR(IF(ISERROR(O43),\"\",IF(OR($D$9=\"Vertical\",$D$9=\"Single Letter\"),INDEX('Current Board'!$B$2:$P$16,VLOOKUP(Scorekeeping!O43,'Standard Board Scores'!$R:$U,3,FALSE),VLOOKUP(Scorekeeping!O43,'Standard Board Scores'!$R:$U,4,FALSE)),\"\")),\"\")),\"\")","v":""},{"$f":"IF(O44<>\"\",IF(IFERROR(IF(P43=\"\",\"\",IF(OR($D$9=\"Vertical\",$D$9=\"Single Letter\"),INDEX('Current Board'!$B$2:$P$16,VLOOKUP(Scorekeeping!P43,'Standard Board Scores'!$R:$U,3,FALSE),VLOOKUP(Scorekeeping!P43,'Standard Board Scores'!$R:$U,4,FALSE)),\"\")),\"\")=0,\"\",IFERROR(IF(ISERROR(P43),\"\",IF(OR($D$9=\"Vertical\",$D$9=\"Single Letter\"),INDEX('Current Board'!$B$2:$P$16,VLOOKUP(Scorekeeping!P43,'Standard Board Scores'!$R:$U,3,FALSE),VLOOKUP(Scorekeeping!P43,'Standard Board Scores'!$R:$U,4,FALSE)),\"\")),\"\")),\"\")","v":""},{"$f":"IF(P44<>\"\",IF(IFERROR(IF(Q43=\"\",\"\",IF(OR($D$9=\"Vertical\",$D$9=\"Single Letter\"),INDEX('Current Board'!$B$2:$P$16,VLOOKUP(Scorekeeping!Q43,'Standard Board Scores'!$R:$U,3,FALSE),VLOOKUP(Scorekeeping!Q43,'Standard Board Scores'!$R:$U,4,FALSE)),\"\")),\"\")=0,\"\",IFERROR(IF(ISERROR(Q43),\"\",IF(OR($D$9=\"Vertical\",$D$9=\"Single Letter\"),INDEX('Current Board'!$B$2:$P$16,VLOOKUP(Scorekeeping!Q43,'Standard Board Scores'!$R:$U,3,FALSE),VLOOKUP(Scorekeeping!Q43,'Standard Board Scores'!$R:$U,4,FALSE)),\"\")),\"\")),\"\")","v":""},{"$f":"IF(Q44<>\"\",IF(IFERROR(IF(R43=\"\",\"\",IF(OR($D$9=\"Vertical\",$D$9=\"Single Letter\"),INDEX('Current Board'!$B$2:$P$16,VLOOKUP(Scorekeeping!R43,'Standard Board Scores'!$R:$U,3,FALSE),VLOOKUP(Scorekeeping!R43,'Standard Board Scores'!$R:$U,4,FALSE)),\"\")),\"\")=0,\"\",IFERROR(IF(ISERROR(R43),\"\",IF(OR($D$9=\"Vertical\",$D$9=\"Single Letter\"),INDEX('Current Board'!$B$2:$P$16,VLOOKUP(Scorekeeping!R43,'Standard Board Scores'!$R:$U,3,FALSE),VLOOKUP(Scorekeeping!R43,'Standard Board Scores'!$R:$U,4,FALSE)),\"\")),\"\")),\"\")","v":""},{"$f":"IF(R44<>\"\",IF(IFERROR(IF(S43=\"\",\"\",IF(OR($D$9=\"Vertical\",$D$9=\"Single Letter\"),INDEX('Current Board'!$B$2:$P$16,VLOOKUP(Scorekeeping!S43,'Standard Board Scores'!$R:$U,3,FALSE),VLOOKUP(Scorekeeping!S43,'Standard Board Scores'!$R:$U,4,FALSE)),\"\")),\"\")=0,\"\",IFERROR(IF(ISERROR(S43),\"\",IF(OR($D$9=\"Vertical\",$D$9=\"Single Letter\"),INDEX('Current Board'!$B$2:$P$16,VLOOKUP(Scorekeeping!S43,'Standard Board Scores'!$R:$U,3,FALSE),VLOOKUP(Scorekeeping!S43,'Standard Board Scores'!$R:$U,4,FALSE)),\"\")),\"\")),\"\")","v":""},{"$f":"IF(S44<>\"\",IF(IFERROR(IF(T43=\"\",\"\",IF(OR($D$9=\"Vertical\",$D$9=\"Single Letter\"),INDEX('Current Board'!$B$2:$P$16,VLOOKUP(Scorekeeping!T43,'Standard Board Scores'!$R:$U,3,FALSE),VLOOKUP(Scorekeeping!T43,'Standard Board Scores'!$R:$U,4,FALSE)),\"\")),\"\")=0,\"\",IFERROR(IF(ISERROR(T43),\"\",IF(OR($D$9=\"Vertical\",$D$9=\"Single Letter\"),INDEX('Current Board'!$B$2:$P$16,VLOOKUP(Scorekeeping!T43,'Standard Board Scores'!$R:$U,3,FALSE),VLOOKUP(Scorekeeping!T43,'Standard Board Scores'!$R:$U,4,FALSE)),\"\")),\"\")),\"\")","v":""},{"$f":"IF(T44<>\"\",IF(IFERROR(IF(U43=\"\",\"\",IF(OR($D$9=\"Vertical\",$D$9=\"Single Letter\"),INDEX('Current Board'!$B$2:$P$16,VLOOKUP(Scorekeeping!U43,'Standard Board Scores'!$R:$U,3,FALSE),VLOOKUP(Scorekeeping!U43,'Standard Board Scores'!$R:$U,4,FALSE)),\"\")),\"\")=0,\"\",IFERROR(IF(ISERROR(U43),\"\",IF(OR($D$9=\"Vertical\",$D$9=\"Single Letter\"),INDEX('Current Board'!$B$2:$P$16,VLOOKUP(Scorekeeping!U43,'Standard Board Scores'!$R:$U,3,FALSE),VLOOKUP(Scorekeeping!U43,'Standard Board Scores'!$R:$U,4,FALSE)),\"\")),\"\")),\"\")","v":""},{"$f":"IF(U44<>\"\",IF(IFERROR(IF(V43=\"\",\"\",IF(OR($D$9=\"Vertical\",$D$9=\"Single Letter\"),INDEX('Current Board'!$B$2:$P$16,VLOOKUP(Scorekeeping!V43,'Standard Board Scores'!$R:$U,3,FALSE),VLOOKUP(Scorekeeping!V43,'Standard Board Scores'!$R:$U,4,FALSE)),\"\")),\"\")=0,\"\",IFERROR(IF(ISERROR(V43),\"\",IF(OR($D$9=\"Vertical\",$D$9=\"Single Letter\"),INDEX('Current Board'!$B$2:$P$16,VLOOKUP(Scorekeeping!V43,'Standard Board Scores'!$R:$U,3,FALSE),VLOOKUP(Scorekeeping!V43,'Standard Board Scores'!$R:$U,4,FALSE)),\"\")),\"\")),\"\")","v":""},{"$f":"IF(V44<>\"\",IF(IFERROR(IF(W43=\"\",\"\",IF(OR($D$9=\"Vertical\",$D$9=\"Single Letter\"),INDEX('Current Board'!$B$2:$P$16,VLOOKUP(Scorekeeping!W43,'Standard Board Scores'!$R:$U,3,FALSE),VLOOKUP(Scorekeeping!W43,'Standard Board Scores'!$R:$U,4,FALSE)),\"\")),\"\")=0,\"\",IFERROR(IF(ISERROR(W43),\"\",IF(OR($D$9=\"Vertical\",$D$9=\"Single Letter\"),INDEX('Current Board'!$B$2:$P$16,VLOOKUP(Scorekeeping!W43,'Standard Board Scores'!$R:$U,3,FALSE),VLOOKUP(Scorekeeping!W43,'Standard Board Scores'!$R:$U,4,FALSE)),\"\")),\"\")),\"\")","v":""},{"$f":"IF(W44<>\"\",IF(IFERROR(IF(X43=\"\",\"\",IF(OR($D$9=\"Vertical\",$D$9=\"Single Letter\"),INDEX('Current Board'!$B$2:$P$16,VLOOKUP(Scorekeeping!X43,'Standard Board Scores'!$R:$U,3,FALSE),VLOOKUP(Scorekeeping!X43,'Standard Board Scores'!$R:$U,4,FALSE)),\"\")),\"\")=0,\"\",IFERROR(IF(ISERROR(X43),\"\",IF(OR($D$9=\"Vertical\",$D$9=\"Single Letter\"),INDEX('Current Board'!$B$2:$P$16,VLOOKUP(Scorekeeping!X43,'Standard Board Scores'!$R:$U,3,FALSE),VLOOKUP(Scorekeeping!X43,'Standard Board Scores'!$R:$U,4,FALSE)),\"\")),\"\")),\"\")","v":""},{"$f":"IF(X44<>\"\",IF(IFERROR(IF(Y43=\"\",\"\",IF(OR($D$9=\"Vertical\",$D$9=\"Single Letter\"),INDEX('Current Board'!$B$2:$P$16,VLOOKUP(Scorekeeping!Y43,'Standard Board Scores'!$R:$U,3,FALSE),VLOOKUP(Scorekeeping!Y43,'Standard Board Scores'!$R:$U,4,FALSE)),\"\")),\"\")=0,\"\",IFERROR(IF(ISERROR(Y43),\"\",IF(OR($D$9=\"Vertical\",$D$9=\"Single Letter\"),INDEX('Current Board'!$B$2:$P$16,VLOOKUP(Scorekeeping!Y43,'Standard Board Scores'!$R:$U,3,FALSE),VLOOKUP(Scorekeeping!Y43,'Standard Board Scores'!$R:$U,4,FALSE)),\"\")),\"\")),\"\")","v":""}]
[null,null,null,null,null,null,null,null,null,null,{"$f":"IFERROR(VLOOKUP(K44,'Tiles Remaining'!$A:$C,3,FALSE),\"\")","v":""},{"$f":"IFERROR(VLOOKUP(L44,'Tiles Remaining'!$A:$C,3,FALSE),\"\")","v":""},{"$f":"IFERROR(VLOOKUP(M44,'Tiles Remaining'!$A:$C,3,FALSE),\"\")","v":""},{"$f":"IFERROR(VLOOKUP(N44,'Tiles Remaining'!$A:$C,3,FALSE),\"\")","v":""},{"$f":"IFERROR(VLOOKUP(O44,'Tiles Remaining'!$A:$C,3,FALSE),\"\")","v":""},{"$f":"IFERROR(VLOOKUP(P44,'Tiles Remaining'!$A:$C,3,FALSE),\"\")","v":""},{"$f":"IFERROR(VLOOKUP(Q44,'Tiles Remaining'!$A:$C,3,FALSE),\"\")","v":""},{"$f":"IFERROR(VLOOKUP(R44,'Tiles Remaining'!$A:$C,3,FALSE),\"\")","v":""},{"$f":"IFERROR(VLOOKUP(S44,'Tiles Remaining'!$A:$C,3,FALSE),\"\")","v":""},{"$f":"IFERROR(VLOOKUP(T44,'Tiles Remaining'!$A:$C,3,FALSE),\"\")","v":""},{"$f":"IFERROR(VLOOKUP(U44,'Tiles Remaining'!$A:$C,3,FALSE),\"\")","v":""},{"$f":"IFERROR(VLOOKUP(V44,'Tiles Remaining'!$A:$C,3,FALSE),\"\")","v":""},{"$f":"IFERROR(VLOOKUP(W44,'Tiles Remaining'!$A:$C,3,FALSE),\"\")","v":""},{"$f":"IFERROR(VLOOKUP(X44,'Tiles Remaining'!$A:$C,3,FALSE),\"\")","v":""},{"$f":"IFERROR(VLOOKUP(Y44,'Tiles Remaining'!$A:$C,3,FALSE),\"\")","v":""},{"$f":"SUM(K45:Y45)","v":0}]
[null,null,null,null,null,null,null,null,null,null,null,"Vertical 7 - Side A"]
[null,null,null,null,null,null,null,null,null,null,null,1,2,3,4,5,6,7,8,9,10,11,12,13,14]
[null,null,null,null,null,null,null,null,null,null,{"$f":"J16","v":""},{"$f":"IF(AND(K48<>\"\",LEFT(K48,1)<>\"B\",LEFT(K48,1)<>\"A\"),CONCATENATE(CHAR(CODE(LEFT(K48,1))-1),REPLACE(K48,1,1,\"\")),\"\")","v":""},{"$f":"IF(AND(L48<>\"\",LEFT(L48,1)<>\"B\",LEFT(L48,1)<>\"A\"),CONCATENATE(CHAR(CODE(LEFT(L48,1))-1),REPLACE(L48,1,1,\"\")),\"\")","v":""},"","","","","","","","","","","",""]
[null,null,null,null,null,null,null,null,null,null,{"$f":"IF(IFERROR(IF(K48=\"\",\"\",IF(OR($D$9=\"Vertical\",$D$9=\"Single Letter\"),INDEX('Current Board'!$B$2:$P$16,VLOOKUP(Scorekeeping!K48,'Standard Board Scores'!$R:$U,3,FALSE),VLOOKUP(Scorekeeping!K48,'Standard Board Scores'!$R:$U,4,FALSE)),\"\")),\"\")=0,\"\",IFERROR(IF(ISERROR(K48),\"\",IF(OR($D$9=\"Vertical\",$D$9=\"Single Letter\"),INDEX('Current Board'!$B$2:$P$16,VLOOKUP(Scorekeeping!K48,'Standard Board Scores'!$R:$U,3,FALSE),VLOOKUP(Scorekeeping!K48,'Standard Board Scores'!$R:$U,4,FALSE)),\"\")),\"\"))","v":""},{"$f":"IF(K49<>\"\",IF(IFERROR(IF(L48=\"\",\"\",IF(OR($D$9=\"Vertical\",$D$9=\"Single Letter\"),INDEX('Current Board'!$B$2:$P$16,VLOOKUP(Scorekeeping!L48,'Standard Board Scores'!$R:$U,3,FALSE),VLOOKUP(Scorekeeping!L48,'Standard Board Scores'!$R:$U,4,FALSE)),\"\")),\"\")=0,\"\",IFERROR(IF(ISERROR(L48),\"\",IF(OR($D$9=\"Vertical\",$D$9=\"Single Letter\"),INDEX('Current Board'!$B$2:$P$16,VLOOKUP(Scorekeeping!L48,'Standard Board Scores'!$R:$U,3,FALSE),VLOOKUP(Scorekeeping!L48,'Standard Board Scores'!$R:$U,4,FALSE)),\"\")),\"\")),\"\")","v":""},{"$f":"IF(L49<>\"\",IF(IFERROR(IF(M48=\"\",\"\",IF(OR($D$9=\"Vertical\",$D$9=\"Single Letter\"),INDEX('Current Board'!$B$2:$P$16,VLOOKUP(Scorekeeping!M48,'Standard Board Scores'!$R:$U,3,FALSE),VLOOKUP(Scorekeeping!M48,'Standard Board Scores'!$R:$U,4,FALSE)),\"\")),\"\")=0,\"\",IFERROR(IF(ISERROR(M48),\"\",IF(OR($D$9=\"Vertical\",$D$9=\"Single Letter\"),INDEX('Current Board'!$B$2:$P$16,VLOOKUP(Scorekeeping!M48,'Standard Board Scores'!$R:$U,3,FALSE),VLOOKUP(Scorekeeping!M48,'Standard Board Scores'!$R:$U,4,FALSE)),\"\")),\"\")),\"\")","v":""},{"$f":"IF(M49<>\"\",IF(IFERROR(IF(N48=\"\",\"\",IF(OR($D$9=\"Vertical\",$D$9=\"Single Letter\"),INDEX('Current Board'!$B$2:$P$16,VLOOKUP(Scorekeeping!N48,'Standard Board Scores'!$R:$U,3,FALSE),VLOOKUP(Scorekeeping!N48,'Standard Board Scores'!$R:$U,4,FALSE)),\"\")),\"\")=0,\"\",IFERROR(IF(ISERROR(N48),\"\",IF(OR($D$9=\"Vertical\",$D$9=\"Single Letter\"),INDEX('Current Board'!$B$2:$P$16,VLOOKUP(Scorekeeping!N48,'Standard Board Scores'!$R:$U,3,FALSE),VLOOKUP(Scorekeeping!N48,'Standard Board Scores'!$R:$U,4,FALSE)),\"\")),\"\")),\"\")","v":""},{"$f":"IF(N49<>\"\",IF(IFERROR(IF(O48=\"\",\"\",IF(OR($D$9=\"Vertical\",$D$9=\"Single Letter\"),INDEX('Current Board'!$B$2:$P$16,VLOOKUP(Scorekeeping!O48,'Standard Board Scores'!$R:$U,3,FALSE),VLOOKUP(Scorekeeping!O48,'Standard Board Scores'!$R:$U,4,FALSE)),\"\")),\"\")=0,\"\",IFERROR(IF(ISERROR(O48),\"\",IF(OR($D$9=\"Vertical\",$D$9=\"Single Letter\"),INDEX('Current Board'!$B$2:$P$16,VLOOKUP(Scorekeeping!O48,'Standard Board Scores'!$R:$U,3,FALSE),VLOOKUP(Scorekeeping!O48,'Standard Board Scores'!$R:$U,4,FALSE)),\"\")),\"\")),\"\")","v":""},{"$f":"IF(O49<>\"\",IF(IFERROR(IF(P48=\"\",\"\",IF(OR($D$9=\"Vertical\",$D$9=\"Single Letter\"),INDEX('Current Board'!$B$2:$P$16,VLOOKUP(Scorekeeping!P48,'Standard Board Scores'!$R:$U,3,FALSE),VLOOKUP(Scorekeeping!P48,'Standard Board Scores'!$R:$U,4,FALSE)),\"\")),\"\")=0,\"\",IFERROR(IF(ISERROR(P48),\"\",IF(OR($D$9=\"Vertical\",$D$9=\"Single Letter\"),INDEX('Current Board'!$B$2:$P$16,VLOOKUP(Scorekeeping!P48,'Standard Board Scores'!$R:$U,3,FALSE),VLOOKUP(Scorekeeping!P48,'Standard Board Scores'!$R:$U,4,FALSE)),\"\")),\"\")),\"\")","v":""},{"$f":"IF(P49<>\"\",IF(IFERROR(IF(Q48=\"\",\"\",IF(OR($D$9=\"Vertical\",$D$9=\"Single Letter\"),INDEX('Current Board'!$B$2:$P$16,VLOOKUP(Scorekeeping!Q48,'Standard Board Scores'!$R:$U,3,FALSE),VLOOKUP(Scorekeeping!Q48,'Standard Board Scores'!$R:$U,4,FALSE)),\"\")),\"\")=0,\"\",IFERROR(IF(ISERROR(Q48),\"\",IF(OR($D$9=\"Vertical\",$D$9=\"Single Letter\"),INDEX('Current Board'!$B$2:$P$16,VLOOKUP(Scorekeeping!Q48,'Standard Board Scores'!$R:$U,3,FALSE),VLOOKUP(Scorekeeping!Q48,'Standard Board Scores'!$R:$U,4,FALSE)),\"\")),\"\")),\"\")","v":""},{"$f":"IF(Q49<>\"\",IF(IFERROR(IF(R48=\"\",\"\",IF(OR($D$9=\"Vertical\",$D$9=\"Single Letter\"),INDEX('Current Board'!$B$2:$P$16,VLOOKUP(Scorekeeping!R48,'Standard Board Scores'!$R:$U,3,FALSE),VLOOKUP(Scorekeeping!R48,'Standard Board Scores'!$R:$U,4,FALSE)),\"\")),\"\")=0,\"\",IFERROR(IF(ISERROR(R48),\"\",IF(OR($D$9=\"Vertical\",$D$9=\"Single Letter\"),INDEX('Current Board'!$B$2:$P$16,VLOOKUP(Scorekeeping!R48,'Standard Board Scores'!$R:$U,3,FALSE),VLOOKUP(Scorekeeping!R48,'Standard Board Scores'!$R:$U,4,FALSE)),\"\")),\"\")),\"\")","v":""},{"$f":"IF(R49<>\"\",IF(IFERROR(IF(S48=\"\",\"\",IF(OR($D$9=\"Vertical\",$D$9=\"Single Letter\"),INDEX('Current Board'!$B$2:$P$16,VLOOKUP(Scorekeeping!S48,'Standard Board Scores'!$R:$U,3,FALSE),VLOOKUP(Scorekeeping!S48,'Standard Board Scores'!$R:$U,4,FALSE)),\"\")),\"\")=0,\"\",IFERROR(IF(ISERROR(S48),\"\",IF(OR($D$9=\"Vertical\",$D$9=\"Single Letter\"),INDEX('Current Board'!$B$2:$P$16,VLOOKUP(Scorekeeping!S48,'Standard Board Scores'!$R:$U,3,FALSE),VLOOKUP(Scorekeeping!S48,'Standard Board Scores'!$R:$U,4,FALSE)),\"\")),\"\")),\"\")","v":""},{"$f":"IF(S49<>\"\",IF(IFERROR(IF(T48=\"\",\"\",IF(OR($D$9=\"Vertical\",$D$9=\"Single Letter\"),INDEX('Current Board'!$B$2:$P$16,VLOOKUP(Scorekeeping!T48,'Standard Board Scores'!$R:$U,3,FALSE),VLOOKUP(Scorekeeping!T48,'Standard Board Scores'!$R:$U,4,FALSE)),\"\")),\"\")=0,\"\",IFERROR(IF(ISERROR(T48),\"\",IF(OR($D$9=\"Vertical\",$D$9=\"Single Letter\"),INDEX('Current Board'!$B$2:$P$16,VLOOKUP(Scorekeeping!T48,'Standard Board Scores'!$R:$U,3,FALSE),VLOOKUP(Scorekeeping!T48,'Standard Board Scores'!$R:$U,4,FALSE)),\"\")),\"\")),\"\")","v":""},{"$f":"IF(T49<>\"\",IF(IFERROR(IF(U48=\"\",\"\",IF(OR($D$9=\"Vertical\",$D$9=\"Single Letter\"),INDEX('Current Board'!$B$2:$P$16,VLOOKUP(Scorekeeping!U48,'Standard Board Scores'!$R:$U,3,FALSE),VLOOKUP(Scorekeeping!U48,'Standard Board Scores'!$R:$U,4,FALSE)),\"\")),\"\")=0,\"\",IFERROR(IF(ISERROR(U48),\"\",IF(OR($D$9=\"Vertical\",$D$9=\"Single Letter\"),INDEX('Current Board'!$B$2:$P$16,VLOOKUP(Scorekeeping!U48,'Standard Board Scores'!$R:$U,3,FALSE),VLOOKUP(Scorekeeping!U48,'Standard Board Scores'!$R:$U,4,FALSE)),\"\")),\"\")),\"\")","v":""},{"$f":"IF(U49<>\"\",IF(IFERROR(IF(V48=\"\",\"\",IF(OR($D$9=\"Vertical\",$D$9=\"Single Letter\"),INDEX('Current Board'!$B$2:$P$16,VLOOKUP(Scorekeeping!V48,'Standard Board Scores'!$R:$U,3,FALSE),VLOOKUP(Scorekeeping!V48,'Standard Board Scores'!$R:$U,4,FALSE)),\"\")),\"\")=0,\"\",IFERROR(IF(ISERROR(V48),\"\",IF(OR($D$9=\"Vertical\",$D$9=\"Single Letter\"),INDEX('Current Board'!$B$2:$P$16,VLOOKUP(Scorekeeping!V48,'Standard Board Scores'!$R:$U,3,FALSE),VLOOKUP(Scorekeeping!V48,'Standard Board Scores'!$R:$U,4,FALSE)),\"\")),\"\")),\"\")","v":""},{"$f":"IF(V49<>\"\",IF(IFERROR(IF(W48=\"\",\"\",IF(OR($D$9=\"Vertical\",$D$9=\"Single Letter\"),INDEX('Current Board'!$B$2:$P$16,VLOOKUP(Scorekeeping!W48,'Standard Board Scores'!$R:$U,3,FALSE),VLOOKUP(Scorekeeping!W48,'Standard Board Scores'!$R:$U,4,FALSE)),\"\")),\"\")=0,\"\",IFERROR(IF(ISERROR(W48),\"\",IF(OR($D$9=\"Vertical\",$D$9=\"Single Letter\"),INDEX('Current Board'!$B$2:$P$16,VLOOKUP(Scorekeeping!W48,'Standard Board Scores'!$R:$U,3,FALSE),VLOOKUP(Scorekeeping!W48,'Standard Board Scores'!$R:$U,4,FALSE)),\"\")),\"\")),\"\")","v":""},{"$f":"IF(W49<>\"\",IF(IFERROR(IF(X48=\"\",\"\",IF(OR($D$9=\"Vertical\",$D$9=\"Single Letter\"),INDEX('Current Board'!$B$2:$P$16,VLOOKUP(Scorekeeping!X48,'Standard Board Scores'!$R:$U,3,FALSE),VLOOKUP(Scorekeeping!X48,'Standard Board Scores'!$R:$U,4,FALSE)),\"\")),\"\")=0,\"\",IFERROR(IF(ISERROR(X48),\"\",IF(OR($D$9=\"Vertical\",$D$9=\"Single Letter\"),INDEX('Current Board'!$B$2:$P$16,VLOOKUP(Scorekeeping!X48,'Standard Board Scores'!$R:$U,3,FALSE),VLOOKUP(Scorekeeping!X48,'Standard Board Scores'!$R:$U,4,FALSE)),\"\")),\"\")),\"\")","v":""},{"$f":"IF(X49<>\"\",IF(IFERROR(IF(Y48=\"\",\"\",IF(OR($D$9=\"Vertical\",$D$9=\"Single Letter\"),INDEX('Current Board'!$B$2:$P$16,VLOOKUP(Scorekeeping!Y48,'Standard Board Scores'!$R:$U,3,FALSE),VLOOKUP(Scorekeeping!Y48,'Standard Board Scores'!$R:$U,4,FALSE)),\"\")),\"\")=0,\"\",IFERROR(IF(ISERROR(Y48),\"\",IF(OR($D$9=\"Vertical\",$D$9=\"Single Letter\"),INDEX('Current Board'!$B$2:$P$16,VLOOKUP(Scorekeeping!Y48,'Standard Board Scores'!$R:$U,3,FALSE),VLOOKUP(Scorekeeping!Y48,'Standard Board Scores'!$R:$U,4,FALSE)),\"\")),\"\")),\"\")","v":""}]
[null,null,null,null,null,null,null,null,null,null,{"$f":"IFERROR(VLOOKUP(K49,'Tiles Remaining'!$A:$C,3,FALSE),\"\")","v":""},{"$f":"IFERROR(VLOOKUP(L49,'Tiles Remaining'!$A:$C,3,FALSE),\"\")","v":""},{"$f":"IFERROR(VLOOKUP(M49,'Tiles Remaining'!$A:$C,3,FALSE),\"\")","v":""},{"$f":"IFERROR(VLOOKUP(N49,'Tiles Remaining'!$A:$C,3,FALSE),\"\")","v":""},{"$f":"IFERROR(VLOOKUP(O49,'Tiles Remaining'!$A:$C,3,FALSE),\"\")","v":""},{"$f":"IFERROR(VLOOKUP(P49,'Tiles Remaining'!$A:$C,3,FALSE),\"\")","v":""},{"$f":"IFERROR(VLOOKUP(Q49,'Tiles Remaining'!$A:$C,3,FALSE),\"\")","v":""},{"$f":"IFERROR(VLOOKUP(R49,'Tiles Remaining'!$A:$C,3,FALSE),\"\")","v":""},{"$f":"IFERROR(VLOOKUP(S49,'Tiles Remaining'!$A:$C,3,FALSE),\"\")","v":""},{"$f":"IFERROR(VLOOKUP(T49,'Tiles Remaining'!$A:$C,3,FALSE),\"\")","v":""},{"$f":"IFERROR(VLOOKUP(U49,'Tiles Remaining'!$A:$C,3,FALSE),\"\")","v":""},{"$f":"IFERROR(VLOOKUP(V49,'Tiles Remaining'!$A:$C,3,FALSE),\"\")","v":""},{"$f":"IFERROR(VLOOKUP(W49,'Tiles Remaining'!$A:$C,3,FALSE),\"\")","v":""},{"$f":"IFERROR(VLOOKUP(X49,'Tiles Remaining'!$A:$C,3,FALSE),\"\")","v":""},{"$f":"IFERROR(VLOOKUP(Y49,'Tiles Remaining'!$A:$C,3,FALSE),\"\")","v":""},{"$f":"SUM(K50:Y50)","v":0}]
[null,null,null,null,null,null,null,null,null,null,null,"Vertical 8 - Side B"]
[null,null,null,null,null,null,null,null,null,null,null,1,2,3,4,5,6,7,8,9,10,11,12,13,14]
[null,null,null,null,null,null,null,null,null,null,{"$f":"D18","v":""},{"$f":"IF(AND(K53<>\"\",LEFT(K53,1)<>\"P\",LEFT(K53,1)<>\"Q\"),CONCATENATE(CHAR(CODE(LEFT(K53,1))+1),REPLACE(K53,1,1,\"\")),\"\")","v":""},{"$f":"IF(AND(L53<>\"\",LEFT(L53,1)<>\"P\",LEFT(L53,1)<>\"Q\"),CONCATENATE(CHAR(CODE(LEFT(L53,1))+1),REPLACE(L53,1,1,\"\")),\"\")","v":""},"","","","","","","","","","","",""]
[null,null,null,null,null,null,null,null,null,null,{"$f":"IF(IFERROR(IF(K53=\"\",\"\",IF(OR($D$9=\"Vertical\",$D$9=\"Single Letter\"),INDEX('Current Board'!$B$2:$P$16,VLOOKUP(Scorekeeping!K53,'Standard Board Scores'!$R:$U,3,FALSE),VLOOKUP(Scorekeeping!K53,'Standard Board Scores'!$R:$U,4,FALSE)),\"\")),\"\")=0,\"\",IFERROR(IF(ISERROR(K53),\"\",IF(OR($D$9=\"Vertical\",$D$9=\"Single Letter\"),INDEX('Current Board'!$B$2:$P$16,VLOOKUP(Scorekeeping!K53,'Standard Board Scores'!$R:$U,3,FALSE),VLOOKUP(Scorekeeping!K53,'Standard Board Scores'!$R:$U,4,FALSE)),\"\")),\"\"))","v":""},{"$f":"IF(K54<>\"\",IF(IFERROR(IF(L53=\"\",\"\",IF(OR($D$9=\"Vertical\",$D$9=\"Single Letter\"),INDEX('Current Board'!$B$2:$P$16,VLOOKUP(Scorekeeping!L53,'Standard Board Scores'!$R:$U,3,FALSE),VLOOKUP(Scorekeeping!L53,'Standard Board Scores'!$R:$U,4,FALSE)),\"\")),\"\")=0,\"\",IFERROR(IF(ISERROR(L53),\"\",IF(OR($D$9=\"Vertical\",$D$9=\"Single Letter\"),INDEX('Current Board'!$B$2:$P$16,VLOOKUP(Scorekeeping!L53,'Standard Board Scores'!$R:$U,3,FALSE),VLOOKUP(Scorekeeping!L53,'Standard Board Scores'!$R:$U,4,FALSE)),\"\")),\"\")),\"\")","v":""},{"$f":"IF(L54<>\"\",IF(IFERROR(IF(M53=\"\",\"\",IF(OR($D$9=\"Vertical\",$D$9=\"Single Letter\"),INDEX('Current Board'!$B$2:$P$16,VLOOKUP(Scorekeeping!M53,'Standard Board Scores'!$R:$U,3,FALSE),VLOOKUP(Scorekeeping!M53,'Standard Board Scores'!$R:$U,4,FALSE)),\"\")),\"\")=0,\"\",IFERROR(IF(ISERROR(M53),\"\",IF(OR($D$9=\"Vertical\",$D$9=\"Single Letter\"),INDEX('Current Board'!$B$2:$P$16,VLOOKUP(Scorekeeping!M53,'Standard Board Scores'!$R:$U,3,FALSE),VLOOKUP(Scorekeeping!M53,'Standard Board Scores'!$R:$U,4,FALSE)),\"\")),\"\")),\"\")","v":""},{"$f":"IF(M54<>\"\",IF(IFERROR(IF(N53=\"\",\"\",IF(OR($D$9=\"Vertical\",$D$9=\"Single Letter\"),INDEX('Current Board'!$B$2:$P$16,VLOOKUP(Scorekeeping!N53,'Standard Board Scores'!$R:$U,3,FALSE),VLOOKUP(Scorekeeping!N53,'Standard Board Scores'!$R:$U,4,FALSE)),\"\")),\"\")=0,\"\",IFERROR(IF(ISERROR(N53),\"\",IF(OR($D$9=\"Vertical\",$D$9=\"Single Letter\"),INDEX('Current Board'!$B$2:$P$16,VLOOKUP(Scorekeeping!N53,'Standard Board Scores'!$R:$U,3,FALSE),VLOOKUP(Scorekeeping!N53,'Standard Board Scores'!$R:$U,4,FALSE)),\"\")),\"\")),\"\")","v":""},{"$f":"IF(N54<>\"\",IF(IFERROR(IF(O53=\"\",\"\",IF(OR($D$9=\"Vertical\",$D$9=\"Single Letter\"),INDEX('Current Board'!$B$2:$P$16,VLOOKUP(Scorekeeping!O53,'Standard Board Scores'!$R:$U,3,FALSE),VLOOKUP(Scorekeeping!O53,'Standard Board Scores'!$R:$U,4,FALSE)),\"\")),\"\")=0,\"\",IFERROR(IF(ISERROR(O53),\"\",IF(OR($D$9=\"Vertical\",$D$9=\"Single Letter\"),INDEX('Current Board'!$B$2:$P$16,VLOOKUP(Scorekeeping!O53,'Standard Board Scores'!$R:$U,3,FALSE),VLOOKUP(Scorekeeping!O53,'Standard Board Scores'!$R:$U,4,FALSE)),\"\")),\"\")),\"\")","v":""},{"$f":"IF(O54<>\"\",IF(IFERROR(IF(P53=\"\",\"\",IF(OR($D$9=\"Vertical\",$D$9=\"Single Letter\"),INDEX('Current Board'!$B$2:$P$16,VLOOKUP(Scorekeeping!P53,'Standard Board Scores'!$R:$U,3,FALSE),VLOOKUP(Scorekeeping!P53,'Standard Board Scores'!$R:$U,4,FALSE)),\"\")),\"\")=0,\"\",IFERROR(IF(ISERROR(P53),\"\",IF(OR($D$9=\"Vertical\",$D$9=\"Single Letter\"),INDEX('Current Board'!$B$2:$P$16,VLOOKUP(Scorekeeping!P53,'Standard Board Scores'!$R:$U,3,FALSE),VLOOKUP(Scorekeeping!P53,'Standard Board Scores'!$R:$U,4,FALSE)),\"\")),\"\")),\"\")","v":""},{"$f":"IF(P54<>\"\",IF(IFERROR(IF(Q53=\"\",\"\",IF(OR($D$9=\"Vertical\",$D$9=\"Single Letter\"),INDEX('Current Board'!$B$2:$P$16,VLOOKUP(Scorekeeping!Q53,'Standard Board Scores'!$R:$U,3,FALSE),VLOOKUP(Scorekeeping!Q53,'Standard Board Scores'!$R:$U,4,FALSE)),\"\")),\"\")=0,\"\",IFERROR(IF(ISERROR(Q53),\"\",IF(OR($D$9=\"Vertical\",$D$9=\"Single Letter\"),INDEX('Current Board'!$B$2:$P$16,VLOOKUP(Scorekeeping!Q53,'Standard Board Scores'!$R:$U,3,FALSE),VLOOKUP(Scorekeeping!Q53,'Standard Board Scores'!$R:$U,4,FALSE)),\"\")),\"\")),\"\")","v":""},{"$f":"IF(Q54<>\"\",IF(IFERROR(IF(R53=\"\",\"\",IF(OR($D$9=\"Vertical\",$D$9=\"Single Letter\"),INDEX('Current Board'!$B$2:$P$16,VLOOKUP(Scorekeeping!R53,'Standard Board Scores'!$R:$U,3,FALSE),VLOOKUP(Scorekeeping!R53,'Standard Board Scores'!$R:$U,4,FALSE)),\"\")),\"\")=0,\"\",IFERROR(IF(ISERROR(R53),\"\",IF(OR($D$9=\"Vertical\",$D$9=\"Single Letter\"),INDEX('Current Board'!$B$2:$P$16,VLOOKUP(Scorekeeping!R53,'Standard Board Scores'!$R:$U,3,FALSE),VLOOKUP(Scorekeeping!R53,'Standard Board Scores'!$R:$U,4,FALSE)),\"\")),\"\")),\"\")","v":""},{"$f":"IF(R54<>\"\",IF(IFERROR(IF(S53=\"\",\"\",IF(OR($D$9=\"Vertical\",$D$9=\"Single Letter\"),INDEX('Current Board'!$B$2:$P$16,VLOOKUP(Scorekeeping!S53,'Standard Board Scores'!$R:$U,3,FALSE),VLOOKUP(Scorekeeping!S53,'Standard Board Scores'!$R:$U,4,FALSE)),\"\")),\"\")=0,\"\",IFERROR(IF(ISERROR(S53),\"\",IF(OR($D$9=\"Vertical\",$D$9=\"Single Letter\"),INDEX('Current Board'!$B$2:$P$16,VLOOKUP(Scorekeeping!S53,'Standard Board Scores'!$R:$U,3,FALSE),VLOOKUP(Scorekeeping!S53,'Standard Board Scores'!$R:$U,4,FALSE)),\"\")),\"\")),\"\")","v":""},{"$f":"IF(S54<>\"\",IF(IFERROR(IF(T53=\"\",\"\",IF(OR($D$9=\"Vertical\",$D$9=\"Single Letter\"),INDEX('Current Board'!$B$2:$P$16,VLOOKUP(Scorekeeping!T53,'Standard Board Scores'!$R:$U,3,FALSE),VLOOKUP(Scorekeeping!T53,'Standard Board Scores'!$R:$U,4,FALSE)),\"\")),\"\")=0,\"\",IFERROR(IF(ISERROR(T53),\"\",IF(OR($D$9=\"Vertical\",$D$9=\"Single Letter\"),INDEX('Current Board'!$B$2:$P$16,VLOOKUP(Scorekeeping!T53,'Standard Board Scores'!$R:$U,3,FALSE),VLOOKUP(Scorekeeping!T53,'Standard Board Scores'!$R:$U,4,FALSE)),\"\")),\"\")),\"\")","v":""},{"$f":"IF(T54<>\"\",IF(IFERROR(IF(U53=\"\",\"\",IF(OR($D$9=\"Vertical\",$D$9=\"Single Letter\"),INDEX('Current Board'!$B$2:$P$16,VLOOKUP(Scorekeeping!U53,'Standard Board Scores'!$R:$U,3,FALSE),VLOOKUP(Scorekeeping!U53,'Standard Board Scores'!$R:$U,4,FALSE)),\"\")),\"\")=0,\"\",IFERROR(IF(ISERROR(U53),\"\",IF(OR($D$9=\"Vertical\",$D$9=\"Single Letter\"),INDEX('Current Board'!$B$2:$P$16,VLOOKUP(Scorekeeping!U53,'Standard Board Scores'!$R:$U,3,FALSE),VLOOKUP(Scorekeeping!U53,'Standard Board Scores'!$R:$U,4,FALSE)),\"\")),\"\")),\"\")","v":""},{"$f":"IF(U54<>\"\",IF(IFERROR(IF(V53=\"\",\"\",IF(OR($D$9=\"Vertical\",$D$9=\"Single Letter\"),INDEX('Current Board'!$B$2:$P$16,VLOOKUP(Scorekeeping!V53,'Standard Board Scores'!$R:$U,3,FALSE),VLOOKUP(Scorekeeping!V53,'Standard Board Scores'!$R:$U,4,FALSE)),\"\")),\"\")=0,\"\",IFERROR(IF(ISERROR(V53),\"\",IF(OR($D$9=\"Vertical\",$D$9=\"Single Letter\"),INDEX('Current Board'!$B$2:$P$16,VLOOKUP(Scorekeeping!V53,'Standard Board Scores'!$R:$U,3,FALSE),VLOOKUP(Scorekeeping!V53,'Standard Board Scores'!$R:$U,4,FALSE)),\"\")),\"\")),\"\")","v":""},{"$f":"IF(V54<>\"\",IF(IFERROR(IF(W53=\"\",\"\",IF(OR($D$9=\"Vertical\",$D$9=\"Single Letter\"),INDEX('Current Board'!$B$2:$P$16,VLOOKUP(Scorekeeping!W53,'Standard Board Scores'!$R:$U,3,FALSE),VLOOKUP(Scorekeeping!W53,'Standard Board Scores'!$R:$U,4,FALSE)),\"\")),\"\")=0,\"\",IFERROR(IF(ISERROR(W53),\"\",IF(OR($D$9=\"Vertical\",$D$9=\"Single Letter\"),INDEX('Current Board'!$B$2:$P$16,VLOOKUP(Scorekeeping!W53,'Standard Board Scores'!$R:$U,3,FALSE),VLOOKUP(Scorekeeping!W53,'Standard Board Scores'!$R:$U,4,FALSE)),\"\")),\"\")),\"\")","v":""},{"$f":"IF(W54<>\"\",IF(IFERROR(IF(X53=\"\",\"\",IF(OR($D$9=\"Vertical\",$D$9=\"Single Letter\"),INDEX('Current Board'!$B$2:$P$16,VLOOKUP(Scorekeeping!X53,'Standard Board Scores'!$R:$U,3,FALSE),VLOOKUP(Scorekeeping!X53,'Standard Board Scores'!$R:$U,4,FALSE)),\"\")),\"\")=0,\"\",IFERROR(IF(ISERROR(X53),\"\",IF(OR($D$9=\"Vertical\",$D$9=\"Single Letter\"),INDEX('Current Board'!$B$2:$P$16,VLOOKUP(Scorekeeping!X53,'Standard Board Scores'!$R:$U,3,FALSE),VLOOKUP(Scorekeeping!X53,'Standard Board Scores'!$R:$U,4,FALSE)),\"\")),\"\")),\"\")","v":""},{"$f":"IF(X54<>\"\",IF(IFERROR(IF(Y53=\"\",\"\",IF(OR($D$9=\"Vertical\",$D$9=\"Single Letter\"),INDEX('Current Board'!$B$2:$P$16,VLOOKUP(Scorekeeping!Y53,'Standard Board Scores'!$R:$U,3,FALSE),VLOOKUP(Scorekeeping!Y53,'Standard Board Scores'!$R:$U,4,FALSE)),\"\")),\"\")=0,\"\",IFERROR(IF(ISERROR(Y53),\"\",IF(OR($D$9=\"Vertical\",$D$9=\"Single Letter\"),INDEX('Current Board'!$B$2:$P$16,VLOOKUP(Scorekeeping!Y53,'Standard Board Scores'!$R:$U,3,FALSE),VLOOKUP(Scorekeeping!Y53,'Standard Board Scores'!$R:$U,4,FALSE)),\"\")),\"\")),\"\")","v":""}]
[null,null,null,null,null,null,null,null,null,null,{"$f":"IFERROR(VLOOKUP(K54,'Tiles Remaining'!$A:$C,3,FALSE),\"\")","v":""},{"$f":"IFERROR(VLOOKUP(L54,'Tiles Remaining'!$A:$C,3,FALSE),\"\")","v":""},{"$f":"IFERROR(VLOOKUP(M54,'Tiles Remaining'!$A:$C,3,FALSE),\"\")","v":""},{"$f":"IFERROR(VLOOKUP(N54,'Tiles Remaining'!$A:$C,3,FALSE),\"\")","v":""},{"$f":"IFERROR(VLOOKUP(O54,'Tiles Remaining'!$A:$C,3,FALSE),\"\")","v":""},{"$f":"IFERROR(VLOOKUP(P54,'Tiles Remaining'!$A:$C,3,FALSE),\"\")","v":""},{"$f":"IFERROR(VLOOKUP(Q54,'Tiles Remaining'!$A:$C,3,FALSE),\"\")","v":""},{"$f":"IFERROR(VLOOKUP(R54,'Tiles Remaining'!$A:$C,3,FALSE),\"\")","v":""},{"$f":"IFERROR(VLOOKUP(S54,'Tiles Remaining'!$A:$C,3,FALSE),\"\")","v":""},{"$f":"IFERROR(VLOOKUP(T54,'Tiles Remaining'!$A:$C,3,FALSE),\"\")","v":""},{"$f":"IFERROR(VLOOKUP(U54,'Tiles Remaining'!$A:$C,3,FALSE),\"\")","v":""},{"$f":"IFERROR(VLOOKUP(V54,'Tiles Remaining'!$A:$C,3,FALSE),\"\")","v":""},{"$f":"IFERROR(VLOOKUP(W54,'Tiles Remaining'!$A:$C,3,FALSE),\"\")","v":""},{"$f":"IFERROR(VLOOKUP(X54,'Tiles Remaining'!$A:$C,3,FALSE),\"\")","v":""},{"$f":"IFERROR(VLOOKUP(Y54,'Tiles Remaining'!$A:$C,3,FALSE),\"\")","v":""},{"$f":"SUM(K55:Y55)","v":0}]
[null,null,null,null,null,null,null,null,null,null,null,"Vertical 9 - Side B"]
[null,null,null,null,null,null,null,null,null,null,null,1,2,3,4,5,6,7,8,9,10,11,12,13,14]
[null,null,null,null,null,null,null,null,null,null,{"$f":"E18","v":""},{"$f":"IF(AND(K58<>\"\",LEFT(K58,1)<>\"P\",LEFT(K58,1)<>\"Q\"),CONCATENATE(CHAR(CODE(LEFT(K58,1))+1),REPLACE(K58,1,1,\"\")),\"\")","v":""},{"$f":"IF(AND(L58<>\"\",LEFT(L58,1)<>\"P\",LEFT(L58,1)<>\"Q\"),CONCATENATE(CHAR(CODE(LEFT(L58,1))+1),REPLACE(L58,1,1,\"\")),\"\")","v":""},"","","","","","","","","","","",""]
[null,null,null,null,null,null,null,null,null,null,{"$f":"IF(IFERROR(IF(K58=\"\",\"\",IF(OR($D$9=\"Vertical\",$D$9=\"Single Letter\"),INDEX('Current Board'!$B$2:$P$16,VLOOKUP(Scorekeeping!K58,'Standard Board Scores'!$R:$U,3,FALSE),VLOOKUP(Scorekeeping!K58,'Standard Board Scores'!$R:$U,4,FALSE)),\"\")),\"\")=0,\"\",IFERROR(IF(ISERROR(K58),\"\",IF(OR($D$9=\"Vertical\",$D$9=\"Single Letter\"),INDEX('Current Board'!$B$2:$P$16,VLOOKUP(Scorekeeping!K58,'Standard Board Scores'!$R:$U,3,FALSE),VLOOKUP(Scorekeeping!K58,'Standard Board Scores'!$R:$U,4,FALSE)),\"\")),\"\"))","v":""},{"$f":"IF(K59<>\"\",IF(IFERROR(IF(L58=\"\",\"\",IF(OR($D$9=\"Vertical\",$D$9=\"Single Letter\"),INDEX('Current Board'!$B$2:$P$16,VLOOKUP(Scorekeeping!L58,'Standard Board Scores'!$R:$U,3,FALSE),VLOOKUP(Scorekeeping!L58,'Standard Board Scores'!$R:$U,4,FALSE)),\"\")),\"\")=0,\"\",IFERROR(IF(ISERROR(L58),\"\",IF(OR($D$9=\"Vertical\",$D$9=\"Single Letter\"),INDEX('Current Board'!$B$2:$P$16,VLOOKUP(Scorekeeping!L58,'Standard Board Scores'!$R:$U,3,FALSE),VLOOKUP(Scorekeeping!L58,'Standard Board Scores'!$R:$U,4,FALSE)),\"\")),\"\")),\"\")","v":""},{"$f":"IF(L59<>\"\",IF(IFERROR(IF(M58=\"\",\"\",IF(OR($D$9=\"Vertical\",$D$9=\"Single Letter\"),INDEX('Current Board'!$B$2:$P$16,VLOOKUP(Scorekeeping!M58,'Standard Board Scores'!$R:$U,3,FALSE),VLOOKUP(Scorekeeping!M58,'Standard Board Scores'!$R:$U,4,FALSE)),\"\")),\"\")=0,\"\",IFERROR(IF(ISERROR(M58),\"\",IF(OR($D$9=\"Vertical\",$D$9=\"Single Letter\"),INDEX('Current Board'!$B$2:$P$16,VLOOKUP(Scorekeeping!M58,'Standard Board Scores'!$R:$U,3,FALSE),VLOOKUP(Scorekeeping!M58,'Standard Board Scores'!$R:$U,4,FALSE)),\"\")),\"\")),\"\")","v":""},{"$f":"IF(M59<>\"\",IF(IFERROR(IF(N58=\"\",\"\",IF(OR($D$9=\"Vertical\",$D$9=\"Single Letter\"),INDEX('Current Board'!$B$2:$P$16,VLOOKUP(Scorekeeping!N58,'Standard Board Scores'!$R:$U,3,FALSE),VLOOKUP(Scorekeeping!N58,'Standard Board Scores'!$R:$U,4,FALSE)),\"\")),\"\")=0,\"\",IFERROR(IF(ISERROR(N58),\"\",IF(OR($D$9=\"Vertical\",$D$9=\"Single Letter\"),INDEX('Current Board'!$B$2:$P$16,VLOOKUP(Scorekeeping!N58,'Standard Board Scores'!$R:$U,3,FALSE),VLOOKUP(Scorekeeping!N58,'Standard Board Scores'!$R:$U,4,FALSE)),\"\")),\"\")),\"\")","v":""},{"$f":"IF(N59<>\"\",IF(IFERROR(IF(O58=\"\",\"\",IF(OR($D$9=\"Vertical\",$D$9=\"Single Letter\"),INDEX('Current Board'!$B$2:$P$16,VLOOKUP(Scorekeeping!O58,'Standard Board Scores'!$R:$U,3,FALSE),VLOOKUP(Scorekeeping!O58,'Standard Board Scores'!$R:$U,4,FALSE)),\"\")),\"\")=0,\"\",IFERROR(IF(ISERROR(O58),\"\",IF(OR($D$9=\"Vertical\",$D$9=\"Single Letter\"),INDEX('Current Board'!$B$2:$P$16,VLOOKUP(Scorekeeping!O58,'Standard Board Scores'!$R:$U,3,FALSE),VLOOKUP(Scorekeeping!O58,'Standard Board Scores'!$R:$U,4,FALSE)),\"\")),\"\")),\"\")","v":""},{"$f":"IF(O59<>\"\",IF(IFERROR(IF(P58=\"\",\"\",IF(OR($D$9=\"Vertical\",$D$9=\"Single Letter\"),INDEX('Current Board'!$B$2:$P$16,VLOOKUP(Scorekeeping!P58,'Standard Board Scores'!$R:$U,3,FALSE),VLOOKUP(Scorekeeping!P58,'Standard Board Scores'!$R:$U,4,FALSE)),\"\")),\"\")=0,\"\",IFERROR(IF(ISERROR(P58),\"\",IF(OR($D$9=\"Vertical\",$D$9=\"Single Letter\"),INDEX('Current Board'!$B$2:$P$16,VLOOKUP(Scorekeeping!P58,'Standard Board Scores'!$R:$U,3,FALSE),VLOOKUP(Scorekeeping!P58,'Standard Board Scores'!$R:$U,4,FALSE)),\"\")),\"\")),\"\")","v":""},{"$f":"IF(P59<>\"\",IF(IFERROR(IF(Q58=\"\",\"\",IF(OR($D$9=\"Vertical\",$D$9=\"Single Letter\"),INDEX('Current Board'!$B$2:$P$16,VLOOKUP(Scorekeeping!Q58,'Standard Board Scores'!$R:$U,3,FALSE),VLOOKUP(Scorekeeping!Q58,'Standard Board Scores'!$R:$U,4,FALSE)),\"\")),\"\")=0,\"\",IFERROR(IF(ISERROR(Q58),\"\",IF(OR($D$9=\"Vertical\",$D$9=\"Single Letter\"),INDEX('Current Board'!$B$2:$P$16,VLOOKUP(Scorekeeping!Q58,'Standard Board Scores'!$R:$U,3,FALSE),VLOOKUP(Scorekeeping!Q58,'Standard Board Scores'!$R:$U,4,FALSE)),\"\")),\"\")),\"\")","v":""},{"$f":"IF(Q59<>\"\",IF(IFERROR(IF(R58=\"\",\"\",IF(OR($D$9=\"Vertical\",$D$9=\"Single Letter\"),INDEX('Current Board'!$B$2:$P$16,VLOOKUP(Scorekeeping!R58,'Standard Board Scores'!$R:$U,3,FALSE),VLOOKUP(Scorekeeping!R58,'Standard Board Scores'!$R:$U,4,FALSE)),\"\")),\"\")=0,\"\",IFERROR(IF(ISERROR(R58),\"\",IF(OR($D$9=\"Vertical\",$D$9=\"Single Letter\"),INDEX('Current Board'!$B$2:$P$16,VLOOKUP(Scorekeeping!R58,'Standard Board Scores'!$R:$U,3,FALSE),VLOOKUP(Scorekeeping!R58,'Standard Board Scores'!$R:$U,4,FALSE)),\"\")),\"\")),\"\")","v":""},{"$f":"IF(R59<>\"\",IF(IFERROR(IF(S58=\"\",\"\",IF(OR($D$9=\"Vertical\",$D$9=\"Single Letter\"),INDEX('Current Board'!$B$2:$P$16,VLOOKUP(Scorekeeping!S58,'Standard Board Scores'!$R:$U,3,FALSE),VLOOKUP(Scorekeeping!S58,'Standard Board Scores'!$R:$U,4,FALSE)),\"\")),\"\")=0,\"\",IFERROR(IF(ISERROR(S58),\"\",IF(OR($D$9=\"Vertical\",$D$9=\"Single Letter\"),INDEX('Current Board'!$B$2:$P$16,VLOOKUP(Scorekeeping!S58,'Standard Board Scores'!$R:$U,3,FALSE),VLOOKUP(Scorekeeping!S58,'Standard Board Scores'!$R:$U,4,FALSE)),\"\")),\"\")),\"\")","v":""},{"$f":"IF(S59<>\"\",IF(IFERROR(IF(T58=\"\",\"\",IF(OR($D$9=\"Vertical\",$D$9=\"Single Letter\"),INDEX('Current Board'!$B$2:$P$16,VLOOKUP(Scorekeeping!T58,'Standard Board Scores'!$R:$U,3,FALSE),VLOOKUP(Scorekeeping!T58,'Standard Board Scores'!$R:$U,4,FALSE)),\"\")),\"\")=0,\"\",IFERROR(IF(ISERROR(T58),\"\",IF(OR($D$9=\"Vertical\",$D$9=\"Single Letter\"),INDEX('Current Board'!$B$2:$P$16,VLOOKUP(Scorekeeping!T58,'Standard Board Scores'!$R:$U,3,FALSE),VLOOKUP(Scorekeeping!T58,'Standard Board Scores'!$R:$U,4,FALSE)),\"\")),\"\")),\"\")","v":""},{"$f":"IF(T59<>\"\",IF(IFERROR(IF(U58=\"\",\"\",IF(OR($D$9=\"Vertical\",$D$9=\"Single Letter\"),INDEX('Current Board'!$B$2:$P$16,VLOOKUP(Scorekeeping!U58,'Standard Board Scores'!$R:$U,3,FALSE),VLOOKUP(Scorekeeping!U58,'Standard Board Scores'!$R:$U,4,FALSE)),\"\")),\"\")=0,\"\",IFERROR(IF(ISERROR(U58),\"\",IF(OR($D$9=\"Vertical\",$D$9=\"Single Letter\"),INDEX('Current Board'!$B$2:$P$16,VLOOKUP(Scorekeeping!U58,'Standard Board Scores'!$R:$U,3,FALSE),VLOOKUP(Scorekeeping!U58,'Standard Board Scores'!$R:$U,4,FALSE)),\"\")),\"\")),\"\")","v":""},{"$f":"IF(U59<>\"\",IF(IFERROR(IF(V58=\"\",\"\",IF(OR($D$9=\"Vertical\",$D$9=\"Single Letter\"),INDEX('Current Board'!$B$2:$P$16,VLOOKUP(Scorekeeping!V58,'Standard Board Scores'!$R:$U,3,FALSE),VLOOKUP(Scorekeeping!V58,'Standard Board Scores'!$R:$U,4,FALSE)),\"\")),\"\")=0,\"\",IFERROR(IF(ISERROR(V58),\"\",IF(OR($D$9=\"Vertical\",$D$9=\"Single Letter\"),INDEX('Current Board'!$B$2:$P$16,VLOOKUP(Scorekeeping!V58,'Standard Board Scores'!$R:$U,3,FALSE),VLOOKUP(Scorekeeping!V58,'Standard Board Scores'!$R:$U,4,FALSE)),\"\")),\"\")),\"\")","v":""},{"$f":"IF(V59<>\"\",IF(IFERROR(IF(W58=\"\",\"\",IF(OR($D$9=\"Vertical\",$D$9=\"Single Letter\"),INDEX('Current Board'!$B$2:$P$16,VLOOKUP(Scorekeeping!W58,'Standard Board Scores'!$R:$U,3,FALSE),VLOOKUP(Scorekeeping!W58,'Standard Board Scores'!$R:$U,4,FALSE)),\"\")),\"\")=0,\"\",IFERROR(IF(ISERROR(W58),\"\",IF(OR($D$9=\"Vertical\",$D$9=\"Single Letter\"),INDEX('Current Board'!$B$2:$P$16,VLOOKUP(Scorekeeping!W58,'Standard Board Scores'!$R:$U,3,FALSE),VLOOKUP(Scorekeeping!W58,'Standard Board Scores'!$R:$U,4,FALSE)),\"\")),\"\")),\"\")","v":""},{"$f":"IF(W59<>\"\",IF(IFERROR(IF(X58=\"\",\"\",IF(OR($D$9=\"Vertical\",$D$9=\"Single Letter\"),INDEX('Current Board'!$B$2:$P$16,VLOOKUP(Scorekeeping!X58,'Standard Board Scores'!$R:$U,3,FALSE),VLOOKUP(Scorekeeping!X58,'Standard Board Scores'!$R:$U,4,FALSE)),\"\")),\"\")=0,\"\",IFERROR(IF(ISERROR(X58),\"\",IF(OR($D$9=\"Vertical\",$D$9=\"Single Letter\"),INDEX('Current Board'!$B$2:$P$16,VLOOKUP(Scorekeeping!X58,'Standard Board Scores'!$R:$U,3,FALSE),VLOOKUP(Scorekeeping!X58,'Standard Board Scores'!$R:$U,4,FALSE)),\"\")),\"\")),\"\")","v":""},{"$f":"IF(X59<>\"\",IF(IFERROR(IF(Y58=\"\",\"\",IF(OR($D$9=\"Vertical\",$D$9=\"Single Letter\"),INDEX('Current Board'!$B$2:$P$16,VLOOKUP(Scorekeeping!Y58,'Standard Board Scores'!$R:$U,3,FALSE),VLOOKUP(Scorekeeping!Y58,'Standard Board Scores'!$R:$U,4,FALSE)),\"\")),\"\")=0,\"\",IFERROR(IF(ISERROR(Y58),\"\",IF(OR($D$9=\"Vertical\",$D$9=\"Single Letter\"),INDEX('Current Board'!$B$2:$P$16,VLOOKUP(Scorekeeping!Y58,'Standard Board Scores'!$R:$U,3,FALSE),VLOOKUP(Scorekeeping!Y58,'Standard Board Scores'!$R:$U,4,FALSE)),\"\")),\"\")),\"\")","v":""}]
[null,null,null,null,null,null,null,null,null,null,{"$f":"IFERROR(VLOOKUP(K59,'Tiles Remaining'!$A:$C,3,FALSE),\"\")","v":""},{"$f":"IFERROR(VLOOKUP(L59,'Tiles Remaining'!$A:$C,3,FALSE),\"\")","v":""},{"$f":"IFERROR(VLOOKUP(M59,'Tiles Remaining'!$A:$C,3,FALSE),\"\")","v":""},{"$f":"IFERROR(VLOOKUP(N59,'Tiles Remaining'!$A:$C,3,FALSE),\"\")","v":""},{"$f":"IFERROR(VLOOKUP(O59,'Tiles Remaining'!$A:$C,3,FALSE),\"\")","v":""},{"$f":"IFERROR(VLOOKUP(P59,'Tiles Remaining'!$A:$C,3,FALSE),\"\")","v":""},{"$f":"IFERROR(VLOOKUP(Q59,'Tiles Remaining'!$A:$C,3,FALSE),\"\")","v":""},{"$f":"IFERROR(VLOOKUP(R59,'Tiles Remaining'!$A:$C,3,FALSE),\"\")","v":""},{"$f":"IFERROR(VLOOKUP(S59,'Tiles Remaining'!$A:$C,3,FALSE),\"\")","v":""},{"$f":"IFERROR(VLOOKUP(T59,'Tiles Remaining'!$A:$C,3,FALSE),\"\")","v":""},{"$f":"IFERROR(VLOOKUP(U59,'Tiles Remaining'!$A:$C,3,FALSE),\"\")","v":""},{"$f":"IFERROR(VLOOKUP(V59,'Tiles Remaining'!$A:$C,3,FALSE),\"\")","v":""},{"$f":"IFERROR(VLOOKUP(W59,'Tiles Remaining'!$A:$C,3,FALSE),\"\")","v":""},{"$f":"IFERROR(VLOOKUP(X59,'Tiles Remaining'!$A:$C,3,FALSE),\"\")","v":""},{"$f":"IFERROR(VLOOKUP(Y59,'Tiles Remaining'!$A:$C,3,FALSE),\"\")","v":""},{"$f":"SUM(K60:Y60)","v":0}]
[null,null,null,null,null,null,null,null,null,null,null,"Vertical 10 - Side B"]
[null,null,null,null,null,null,null,null,null,null,null,1,2,3,4,5,6,7,8,9,10,11,12,13,14]
[null,null,null,null,null,null,null,null,null,null,{"$f":"F18","v":""},{"$f":"IF(AND(K63<>\"\",LEFT(K63,1)<>\"P\",LEFT(K63,1)<>\"Q\"),CONCATENATE(CHAR(CODE(LEFT(K63,1))+1),REPLACE(K63,1,1,\"\")),\"\")","v":""},{"$f":"IF(AND(L63<>\"\",LEFT(L63,1)<>\"P\",LEFT(L63,1)<>\"Q\"),CONCATENATE(CHAR(CODE(LEFT(L63,1))+1),REPLACE(L63,1,1,\"\")),\"\")","v":""},"","","","","","","","","","","",""]
[null,null,null,null,null,null,null,null,null,null,{"$f":"IF(IFERROR(IF(K63=\"\",\"\",IF(OR($D$9=\"Vertical\",$D$9=\"Single Letter\"),INDEX('Current Board'!$B$2:$P$16,VLOOKUP(Scorekeeping!K63,'Standard Board Scores'!$R:$U,3,FALSE),VLOOKUP(Scorekeeping!K63,'Standard Board Scores'!$R:$U,4,FALSE)),\"\")),\"\")=0,\"\",IFERROR(IF(ISERROR(K63),\"\",IF(OR($D$9=\"Vertical\",$D$9=\"Single Letter\"),INDEX('Current Board'!$B$2:$P$16,VLOOKUP(Scorekeeping!K63,'Standard Board Scores'!$R:$U,3,FALSE),VLOOKUP(Scorekeeping!K63,'Standard Board Scores'!$R:$U,4,FALSE)),\"\")),\"\"))","v":""},{"$f":"IF(K64<>\"\",IF(IFERROR(IF(L63=\"\",\"\",IF(OR($D$9=\"Vertical\",$D$9=\"Single Letter\"),INDEX('Current Board'!$B$2:$P$16,VLOOKUP(Scorekeeping!L63,'Standard Board Scores'!$R:$U,3,FALSE),VLOOKUP(Scorekeeping!L63,'Standard Board Scores'!$R:$U,4,FALSE)),\"\")),\"\")=0,\"\",IFERROR(IF(ISERROR(L63),\"\",IF(OR($D$9=\"Vertical\",$D$9=\"Single Letter\"),INDEX('Current Board'!$B$2:$P$16,VLOOKUP(Scorekeeping!L63,'Standard Board Scores'!$R:$U,3,FALSE),VLOOKUP(Scorekeeping!L63,'Standard Board Scores'!$R:$U,4,FALSE)),\"\")),\"\")),\"\")","v":""},{"$f":"IF(L64<>\"\",IF(IFERROR(IF(M63=\"\",\"\",IF(OR($D$9=\"Vertical\",$D$9=\"Single Letter\"),INDEX('Current Board'!$B$2:$P$16,VLOOKUP(Scorekeeping!M63,'Standard Board Scores'!$R:$U,3,FALSE),VLOOKUP(Scorekeeping!M63,'Standard Board Scores'!$R:$U,4,FALSE)),\"\")),\"\")=0,\"\",IFERROR(IF(ISERROR(M63),\"\",IF(OR($D$9=\"Vertical\",$D$9=\"Single Letter\"),INDEX('Current Board'!$B$2:$P$16,VLOOKUP(Scorekeeping!M63,'Standard Board Scores'!$R:$U,3,FALSE),VLOOKUP(Scorekeeping!M63,'Standard Board Scores'!$R:$U,4,FALSE)),\"\")),\"\")),\"\")","v":""},{"$f":"IF(M64<>\"\",IF(IFERROR(IF(N63=\"\",\"\",IF(OR($D$9=\"Vertical\",$D$9=\"Single Letter\"),INDEX('Current Board'!$B$2:$P$16,VLOOKUP(Scorekeeping!N63,'Standard Board Scores'!$R:$U,3,FALSE),VLOOKUP(Scorekeeping!N63,'Standard Board Scores'!$R:$U,4,FALSE)),\"\")),\"\")=0,\"\",IFERROR(IF(ISERROR(N63),\"\",IF(OR($D$9=\"Vertical\",$D$9=\"Single Letter\"),INDEX('Current Board'!$B$2:$P$16,VLOOKUP(Scorekeeping!N63,'Standard Board Scores'!$R:$U,3,FALSE),VLOOKUP(Scorekeeping!N63,'Standard Board Scores'!$R:$U,4,FALSE)),\"\")),\"\")),\"\")","v":""},{"$f":"IF(N64<>\"\",IF(IFERROR(IF(O63=\"\",\"\",IF(OR($D$9=\"Vertical\",$D$9=\"Single Letter\"),INDEX('Current Board'!$B$2:$P$16,VLOOKUP(Scorekeeping!O63,'Standard Board Scores'!$R:$U,3,FALSE),VLOOKUP(Scorekeeping!O63,'Standard Board Scores'!$R:$U,4,FALSE)),\"\")),\"\")=0,\"\",IFERROR(IF(ISERROR(O63),\"\",IF(OR($D$9=\"Vertical\",$D$9=\"Single Letter\"),INDEX('Current Board'!$B$2:$P$16,VLOOKUP(Scorekeeping!O63,'Standard Board Scores'!$R:$U,3,FALSE),VLOOKUP(Scorekeeping!O63,'Standard Board Scores'!$R:$U,4,FALSE)),\"\")),\"\")),\"\")","v":""},{"$f":"IF(O64<>\"\",IF(IFERROR(IF(P63=\"\",\"\",IF(OR($D$9=\"Vertical\",$D$9=\"Single Letter\"),INDEX('Current Board'!$B$2:$P$16,VLOOKUP(Scorekeeping!P63,'Standard Board Scores'!$R:$U,3,FALSE),VLOOKUP(Scorekeeping!P63,'Standard Board Scores'!$R:$U,4,FALSE)),\"\")),\"\")=0,\"\",IFERROR(IF(ISERROR(P63),\"\",IF(OR($D$9=\"Vertical\",$D$9=\"Single Letter\"),INDEX('Current Board'!$B$2:$P$16,VLOOKUP(Scorekeeping!P63,'Standard Board Scores'!$R:$U,3,FALSE),VLOOKUP(Scorekeeping!P63,'Standard Board Scores'!$R:$U,4,FALSE)),\"\")),\"\")),\"\")","v":""},{"$f":"IF(P64<>\"\",IF(IFERROR(IF(Q63=\"\",\"\",IF(OR($D$9=\"Vertical\",$D$9=\"Single Letter\"),INDEX('Current Board'!$B$2:$P$16,VLOOKUP(Scorekeeping!Q63,'Standard Board Scores'!$R:$U,3,FALSE),VLOOKUP(Scorekeeping!Q63,'Standard Board Scores'!$R:$U,4,FALSE)),\"\")),\"\")=0,\"\",IFERROR(IF(ISERROR(Q63),\"\",IF(OR($D$9=\"Vertical\",$D$9=\"Single Letter\"),INDEX('Current Board'!$B$2:$P$16,VLOOKUP(Scorekeeping!Q63,'Standard Board Scores'!$R:$U,3,FALSE),VLOOKUP(Scorekeeping!Q63,'Standard Board Scores'!$R:$U,4,FALSE)),\"\")),\"\")),\"\")","v":""},{"$f":"IF(Q64<>\"\",IF(IFERROR(IF(R63=\"\",\"\",IF(OR($D$9=\"Vertical\",$D$9=\"Single Letter\"),INDEX('Current Board'!$B$2:$P$16,VLOOKUP(Scorekeeping!R63,'Standard Board Scores'!$R:$U,3,FALSE),VLOOKUP(Scorekeeping!R63,'Standard Board Scores'!$R:$U,4,FALSE)),\"\")),\"\")=0,\"\",IFERROR(IF(ISERROR(R63),\"\",IF(OR($D$9=\"Vertical\",$D$9=\"Single Letter\"),INDEX('Current Board'!$B$2:$P$16,VLOOKUP(Scorekeeping!R63,'Standard Board Scores'!$R:$U,3,FALSE),VLOOKUP(Scorekeeping!R63,'Standard Board Scores'!$R:$U,4,FALSE)),\"\")),\"\")),\"\")","v":""},{"$f":"IF(R64<>\"\",IF(IFERROR(IF(S63=\"\",\"\",IF(OR($D$9=\"Vertical\",$D$9=\"Single Letter\"),INDEX('Current Board'!$B$2:$P$16,VLOOKUP(Scorekeeping!S63,'Standard Board Scores'!$R:$U,3,FALSE),VLOOKUP(Scorekeeping!S63,'Standard Board Scores'!$R:$U,4,FALSE)),\"\")),\"\")=0,\"\",IFERROR(IF(ISERROR(S63),\"\",IF(OR($D$9=\"Vertical\",$D$9=\"Single Letter\"),INDEX('Current Board'!$B$2:$P$16,VLOOKUP(Scorekeeping!S63,'Standard Board Scores'!$R:$U,3,FALSE),VLOOKUP(Scorekeeping!S63,'Standard Board Scores'!$R:$U,4,FALSE)),\"\")),\"\")),\"\")","v":""},{"$f":"IF(S64<>\"\",IF(IFERROR(IF(T63=\"\",\"\",IF(OR($D$9=\"Vertical\",$D$9=\"Single Letter\"),INDEX('Current Board'!$B$2:$P$16,VLOOKUP(Scorekeeping!T63,'Standard Board Scores'!$R:$U,3,FALSE),VLOOKUP(Scorekeeping!T63,'Standard Board Scores'!$R:$U,4,FALSE)),\"\")),\"\")=0,\"\",IFERROR(IF(ISERROR(T63),\"\",IF(OR($D$9=\"Vertical\",$D$9=\"Single Letter\"),INDEX('Current Board'!$B$2:$P$16,VLOOKUP(Scorekeeping!T63,'Standard Board Scores'!$R:$U,3,FALSE),VLOOKUP(Scorekeeping!T63,'Standard Board Scores'!$R:$U,4,FALSE)),\"\")),\"\")),\"\")","v":""},{"$f":"IF(T64<>\"\",IF(IFERROR(IF(U63=\"\",\"\",IF(OR($D$9=\"Vertical\",$D$9=\"Single Letter\"),INDEX('Current Board'!$B$2:$P$16,VLOOKUP(Scorekeeping!U63,'Standard Board Scores'!$R:$U,3,FALSE),VLOOKUP(Scorekeeping!U63,'Standard Board Scores'!$R:$U,4,FALSE)),\"\")),\"\")=0,\"\",IFERROR(IF(ISERROR(U63),\"\",IF(OR($D$9=\"Vertical\",$D$9=\"Single Letter\"),INDEX('Current Board'!$B$2:$P$16,VLOOKUP(Scorekeeping!U63,'Standard Board Scores'!$R:$U,3,FALSE),VLOOKUP(Scorekeeping!U63,'Standard Board Scores'!$R:$U,4,FALSE)),\"\")),\"\")),\"\")","v":""},{"$f":"IF(U64<>\"\",IF(IFERROR(IF(V63=\"\",\"\",IF(OR($D$9=\"Vertical\",$D$9=\"Single Letter\"),INDEX('Current Board'!$B$2:$P$16,VLOOKUP(Scorekeeping!V63,'Standard Board Scores'!$R:$U,3,FALSE),VLOOKUP(Scorekeeping!V63,'Standard Board Scores'!$R:$U,4,FALSE)),\"\")),\"\")=0,\"\",IFERROR(IF(ISERROR(V63),\"\",IF(OR($D$9=\"Vertical\",$D$9=\"Single Letter\"),INDEX('Current Board'!$B$2:$P$16,VLOOKUP(Scorekeeping!V63,'Standard Board Scores'!$R:$U,3,FALSE),VLOOKUP(Scorekeeping!V63,'Standard Board Scores'!$R:$U,4,FALSE)),\"\")),\"\")),\"\")","v":""},{"$f":"IF(V64<>\"\",IF(IFERROR(IF(W63=\"\",\"\",IF(OR($D$9=\"Vertical\",$D$9=\"Single Letter\"),INDEX('Current Board'!$B$2:$P$16,VLOOKUP(Scorekeeping!W63,'Standard Board Scores'!$R:$U,3,FALSE),VLOOKUP(Scorekeeping!W63,'Standard Board Scores'!$R:$U,4,FALSE)),\"\")),\"\")=0,\"\",IFERROR(IF(ISERROR(W63),\"\",IF(OR($D$9=\"Vertical\",$D$9=\"Single Letter\"),INDEX('Current Board'!$B$2:$P$16,VLOOKUP(Scorekeeping!W63,'Standard Board Scores'!$R:$U,3,FALSE),VLOOKUP(Scorekeeping!W63,'Standard Board Scores'!$R:$U,4,FALSE)),\"\")),\"\")),\"\")","v":""},{"$f":"IF(W64<>\"\",IF(IFERROR(IF(X63=\"\",\"\",IF(OR($D$9=\"Vertical\",$D$9=\"Single Letter\"),INDEX('Current Board'!$B$2:$P$16,VLOOKUP(Scorekeeping!X63,'Standard Board Scores'!$R:$U,3,FALSE),VLOOKUP(Scorekeeping!X63,'Standard Board Scores'!$R:$U,4,FALSE)),\"\")),\"\")=0,\"\",IFERROR(IF(ISERROR(X63),\"\",IF(OR($D$9=\"Vertical\",$D$9=\"Single Letter\"),INDEX('Current Board'!$B$2:$P$16,VLOOKUP(Scorekeeping!X63,'Standard Board Scores'!$R:$U,3,FALSE),VLOOKUP(Scorekeeping!X63,'Standard Board Scores'!$R:$U,4,FALSE)),\"\")),\"\")),\"\")","v":""},{"$f":"IF(X64<>\"\",IF(IFERROR(IF(Y63=\"\",\"\",IF(OR($D$9=\"Vertical\",$D$9=\"Single Letter\"),INDEX('Current Board'!$B$2:$P$16,VLOOKUP(Scorekeeping!Y63,'Standard Board Scores'!$R:$U,3,FALSE),VLOOKUP(Scorekeeping!Y63,'Standard Board Scores'!$R:$U,4,FALSE)),\"\")),\"\")=0,\"\",IFERROR(IF(ISERROR(Y63),\"\",IF(OR($D$9=\"Vertical\",$D$9=\"Single Letter\"),INDEX('Current Board'!$B$2:$P$16,VLOOKUP(Scorekeeping!Y63,'Standard Board Scores'!$R:$U,3,FALSE),VLOOKUP(Scorekeeping!Y63,'Standard Board Scores'!$R:$U,4,FALSE)),\"\")),\"\")),\"\")","v":""}]
[null,null,null,null,null,null,null,null,null,null,{"$f":"IFERROR(VLOOKUP(K64,'Tiles Remaining'!$A:$C,3,FALSE),\"\")","v":""},{"$f":"IFERROR(VLOOKUP(L64,'Tiles Remaining'!$A:$C,3,FALSE),\"\")","v":""},{"$f":"IFERROR(VLOOKUP(M64,'Tiles Remaining'!$A:$C,3,FALSE),\"\")","v":""},{"$f":"IFERROR(VLOOKUP(N64,'Tiles Remaining'!$A:$C,3,FALSE),\"\")","v":""},{"$f":"IFERROR(VLOOKUP(O64,'Tiles Remaining'!$A:$C,3,FALSE),\"\")","v":""},{"$f":"IFERROR(VLOOKUP(P64,'Tiles Remaining'!$A:$C,3,FALSE),\"\")","v":""},{"$f":"IFERROR(VLOOKUP(Q64,'Tiles Remaining'!$A:$C,3,FALSE),\"\")","v":""},{"$f":"IFERROR(VLOOKUP(R64,'Tiles Remaining'!$A:$C,3,FALSE),\"\")","v":""},{"$f":"IFERROR(VLOOKUP(S64,'Tiles Remaining'!$A:$C,3,FALSE),\"\")","v":""},{"$f":"IFERROR(VLOOKUP(T64,'Tiles Remaining'!$A:$C,3,FALSE),\"\")","v":""},{"$f":"IFERROR(VLOOKUP(U64,'Tiles Remaining'!$A:$C,3,FALSE),\"\")","v":""},{"$f":"IFERROR(VLOOKUP(V64,'Tiles Remaining'!$A:$C,3,FALSE),\"\")","v":""},{"$f":"IFERROR(VLOOKUP(W64,'Tiles Remaining'!$A:$C,3,FALSE),\"\")","v":""},{"$f":"IFERROR(VLOOKUP(X64,'Tiles Remaining'!$A:$C,3,FALSE),\"\")","v":""},{"$f":"IFERROR(VLOOKUP(Y64,'Tiles Remaining'!$A:$C,3,FALSE),\"\")","v":""},{"$f":"SUM(K65:Y65)","v":0}]
[null,null,null,null,null,null,null,null,null,null,null,"Vertical 11 - Side B"]
[null,null,null,null,null,null,null,null,null,null,null,1,2,3,4,5,6,7,8,9,10,11,12,13,14]
[null,null,null,null,null,null,null,null,null,null,{"$f":"IF(IFERROR(IF(K67=\"\",\"\",IF(OR($D$9=\"Vertical\",$D$9=\"Single Letter\"),INDEX('Current Board'!$B$2:$P$16,VLOOKUP(Scorekeeping!K67,'Standard Board Scores'!$R:$U,3,FALSE),VLOOKUP(Scorekeeping!K67,'Standard Board Scores'!$R:$U,4,FALSE)),\"\")),\"\")=0,\"\",IFERROR(IF(ISERROR(K67),\"\",IF(OR($D$9=\"Vertical\",$D$9=\"Single Letter\"),INDEX('Current Board'!$B$2:$P$16,VLOOKUP(Scorekeeping!K67,'Standard Board Scores'!$R:$U,3,FALSE),VLOOKUP(Scorekeeping!K67,'Standard Board Scores'!$R:$U,4,FALSE)),\"\")),\"\"))","v":""},{"$f":"IF(AND(K68<>\"\",LEFT(K68,1)<>\"P\",LEFT(K68,1)<>\"Q\"),CONCATENATE(CHAR(CODE(LEFT(K68,1))+1),REPLACE(K68,1,1,\"\")),\"\")","v":""},{"$f":"IF(AND(L68<>\"\",LEFT(L68,1)<>\"P\",LEFT(L68,1)<>\"Q\"),CONCATENATE(CHAR(CODE(LEFT(L68,1))+1),REPLACE(L68,1,1,\"\")),\"\")","v":""},"","","","","","","","","","","",""]
[null,null,null,null,null,null,null,null,null,null,null,{"$f":"IF(K69<>\"\",IF(IFERROR(IF(L68=\"\",\"\",IF(OR($D$9=\"Vertical\",$D$9=\"Single Letter\"),INDEX('Current Board'!$B$2:$P$16,VLOOKUP(Scorekeeping!L68,'Standard Board Scores'!$R:$U,3,FALSE),VLOOKUP(Scorekeeping!L68,'Standard Board Scores'!$R:$U,4,FALSE)),\"\")),\"\")=0,\"\",IFERROR(IF(ISERROR(L68),\"\",IF(OR($D$9=\"Vertical\",$D$9=\"Single Letter\"),INDEX('Current Board'!$B$2:$P$16,VLOOKUP(Scorekeeping!L68,'Standard Board Scores'!$R:$U,3,FALSE),VLOOKUP(Scorekeeping!L68,'Standard Board Scores'!$R:$U,4,FALSE)),\"\")),\"\")),\"\")","v":""},{"$f":"IF(L69<>\"\",IF(IFERROR(IF(M68=\"\",\"\",IF(OR($D$9=\"Vertical\",$D$9=\"Single Letter\"),INDEX('Current Board'!$B$2:$P$16,VLOOKUP(Scorekeeping!M68,'Standard Board Scores'!$R:$U,3,FALSE),VLOOKUP(Scorekeeping!M68,'Standard Board Scores'!$R:$U,4,FALSE)),\"\")),\"\")=0,\"\",IFERROR(IF(ISERROR(M68),\"\",IF(OR($D$9=\"Vertical\",$D$9=\"Single Letter\"),INDEX('Current Board'!$B$2:$P$16,VLOOKUP(Scorekeeping!M68,'Standard Board Scores'!$R:$U,3,FALSE),VLOOKUP(Scorekeeping!M68,'Standard Board Scores'!$R:$U,4,FALSE)),\"\")),\"\")),\"\")","v":""},{"$f":"IF(M69<>\"\",IF(IFERROR(IF(N68=\"\",\"\",IF(OR($D$9=\"Vertical\",$D$9=\"Single Letter\"),INDEX('Current Board'!$B$2:$P$16,VLOOKUP(Scorekeeping!N68,'Standard Board Scores'!$R:$U,3,FALSE),VLOOKUP(Scorekeeping!N68,'Standard Board Scores'!$R:$U,4,FALSE)),\"\")),\"\")=0,\"\",IFERROR(IF(ISERROR(N68),\"\",IF(OR($D$9=\"Vertical\",$D$9=\"Single Letter\"),INDEX('Current Board'!$B$2:$P$16,VLOOKUP(Scorekeeping!N68,'Standard Board Scores'!$R:$U,3,FALSE),VLOOKUP(Scorekeeping!N68,'Standard Board Scores'!$R:$U,4,FALSE)),\"\")),\"\")),\"\")","v":""},{"$f":"IF(N69<>\"\",IF(IFERROR(IF(O68=\"\",\"\",IF(OR($D$9=\"Vertical\",$D$9=\"Single Letter\"),INDEX('Current Board'!$B$2:$P$16,VLOOKUP(Scorekeeping!O68,'Standard Board Scores'!$R:$U,3,FALSE),VLOOKUP(Scorekeeping!O68,'Standard Board Scores'!$R:$U,4,FALSE)),\"\")),\"\")=0,\"\",IFERROR(IF(ISERROR(O68),\"\",IF(OR($D$9=\"Vertical\",$D$9=\"Single Letter\"),INDEX('Current Board'!$B$2:$P$16,VLOOKUP(Scorekeeping!O68,'Standard Board Scores'!$R:$U,3,FALSE),VLOOKUP(Scorekeeping!O68,'Standard Board Scores'!$R:$U,4,FALSE)),\"\")),\"\")),\"\")","v":""},{"$f":"IF(O69<>\"\",IF(IFERROR(IF(P68=\"\",\"\",IF(OR($D$9=\"Vertical\",$D$9=\"Single Letter\"),INDEX('Current Board'!$B$2:$P$16,VLOOKUP(Scorekeeping!P68,'Standard Board Scores'!$R:$U,3,FALSE),VLOOKUP(Scorekeeping!P68,'Standard Board Scores'!$R:$U,4,FALSE)),\"\")),\"\")=0,\"\",IFERROR(IF(ISERROR(P68),\"\",IF(OR($D$9=\"Vertical\",$D$9=\"Single Letter\"),INDEX('Current Board'!$B$2:$P$16,VLOOKUP(Scorekeeping!P68,'Standard Board Scores'!$R:$U,3,FALSE),VLOOKUP(Scorekeeping!P68,'Standard Board Scores'!$R:$U,4,FALSE)),\"\")),\"\")),\"\")","v":""},{"$f":"IF(P69<>\"\",IF(IFERROR(IF(Q68=\"\",\"\",IF(OR($D$9=\"Vertical\",$D$9=\"Single Letter\"),INDEX('Current Board'!$B$2:$P$16,VLOOKUP(Scorekeeping!Q68,'Standard Board Scores'!$R:$U,3,FALSE),VLOOKUP(Scorekeeping!Q68,'Standard Board Scores'!$R:$U,4,FALSE)),\"\")),\"\")=0,\"\",IFERROR(IF(ISERROR(Q68),\"\",IF(OR($D$9=\"Vertical\",$D$9=\"Single Letter\"),INDEX('Current Board'!$B$2:$P$16,VLOOKUP(Scorekeeping!Q68,'Standard Board Scores'!$R:$U,3,FALSE),VLOOKUP(Scorekeeping!Q68,'Standard Board Scores'!$R:$U,4,FALSE)),\"\")),\"\")),\"\")","v":""},{"$f":"IF(Q69<>\"\",IF(IFERROR(IF(R68=\"\",\"\",IF(OR($D$9=\"Vertical\",$D$9=\"Single Letter\"),INDEX('Current Board'!$B$2:$P$16,VLOOKUP(Scorekeeping!R68,'Standard Board Scores'!$R:$U,3,FALSE),VLOOKUP(Scorekeeping!R68,'Standard Board Scores'!$R:$U,4,FALSE)),\"\")),\"\")=0,\"\",IFERROR(IF(ISERROR(R68),\"\",IF(OR($D$9=\"Vertical\",$D$9=\"Single Letter\"),INDEX('Current Board'!$B$2:$P$16,VLOOKUP(Scorekeeping!R68,'Standard Board Scores'!$R:$U,3,FALSE),VLOOKUP(Scorekeeping!R68,'Standard Board Scores'!$R:$U,4,FALSE)),\"\")),\"\")),\"\")","v":""},{"$f":"IF(R69<>\"\",IF(IFERROR(IF(S68=\"\",\"\",IF(OR($D$9=\"Vertical\",$D$9=\"Single Letter\"),INDEX('Current Board'!$B$2:$P$16,VLOOKUP(Scorekeeping!S68,'Standard Board Scores'!$R:$U,3,FALSE),VLOOKUP(Scorekeeping!S68,'Standard Board Scores'!$R:$U,4,FALSE)),\"\")),\"\")=0,\"\",IFERROR(IF(ISERROR(S68),\"\",IF(OR($D$9=\"Vertical\",$D$9=\"Single Letter\"),INDEX('Current Board'!$B$2:$P$16,VLOOKUP(Scorekeeping!S68,'Standard Board Scores'!$R:$U,3,FALSE),VLOOKUP(Scorekeeping!S68,'Standard Board Scores'!$R:$U,4,FALSE)),\"\")),\"\")),\"\")","v":""},{"$f":"IF(S69<>\"\",IF(IFERROR(IF(T68=\"\",\"\",IF(OR($D$9=\"Vertical\",$D$9=\"Single Letter\"),INDEX('Current Board'!$B$2:$P$16,VLOOKUP(Scorekeeping!T68,'Standard Board Scores'!$R:$U,3,FALSE),VLOOKUP(Scorekeeping!T68,'Standard Board Scores'!$R:$U,4,FALSE)),\"\")),\"\")=0,\"\",IFERROR(IF(ISERROR(T68),\"\",IF(OR($D$9=\"Vertical\",$D$9=\"Single Letter\"),INDEX('Current Board'!$B$2:$P$16,VLOOKUP(Scorekeeping!T68,'Standard Board Scores'!$R:$U,3,FALSE),VLOOKUP(Scorekeeping!T68,'Standard Board Scores'!$R:$U,4,FALSE)),\"\")),\"\")),\"\")","v":""},{"$f":"IF(T69<>\"\",IF(IFERROR(IF(U68=\"\",\"\",IF(OR($D$9=\"Vertical\",$D$9=\"Single Letter\"),INDEX('Current Board'!$B$2:$P$16,VLOOKUP(Scorekeeping!U68,'Standard Board Scores'!$R:$U,3,FALSE),VLOOKUP(Scorekeeping!U68,'Standard Board Scores'!$R:$U,4,FALSE)),\"\")),\"\")=0,\"\",IFERROR(IF(ISERROR(U68),\"\",IF(OR($D$9=\"Vertical\",$D$9=\"Single Letter\"),INDEX('Current Board'!$B$2:$P$16,VLOOKUP(Scorekeeping!U68,'Standard Board Scores'!$R:$U,3,FALSE),VLOOKUP(Scorekeeping!U68,'Standard Board Scores'!$R:$U,4,FALSE)),\"\")),\"\")),\"\")","v":""},{"$f":"IF(U69<>\"\",IF(IFERROR(IF(V68=\"\",\"\",IF(OR($D$9=\"Vertical\",$D$9=\"Single Letter\"),INDEX('Current Board'!$B$2:$P$16,VLOOKUP(Scorekeeping!V68,'Standard Board Scores'!$R:$U,3,FALSE),VLOOKUP(Scorekeeping!V68,'Standard Board Scores'!$R:$U,4,FALSE)),\"\")),\"\")=0,\"\",IFERROR(IF(ISERROR(V68),\"\",IF(OR($D$9=\"Vertical\",$D$9=\"Single Letter\"),INDEX('Current Board'!$B$2:$P$16,VLOOKUP(Scorekeeping!V68,'Standard Board Scores'!$R:$U,3,FALSE),VLOOKUP(Scorekeeping!V68,'Standard Board Scores'!$R:$U,4,FALSE)),\"\")),\"\")),\"\")","v":""},{"$f":"IF(V69<>\"\",IF(IFERROR(IF(W68=\"\",\"\",IF(OR($D$9=\"Vertical\",$D$9=\"Single Letter\"),INDEX('Current Board'!$B$2:$P$16,VLOOKUP(Scorekeeping!W68,'Standard Board Scores'!$R:$U,3,FALSE),VLOOKUP(Scorekeeping!W68,'Standard Board Scores'!$R:$U,4,FALSE)),\"\")),\"\")=0,\"\",IFERROR(IF(ISERROR(W68),\"\",IF(OR($D$9=\"Vertical\",$D$9=\"Single Letter\"),INDEX('Current Board'!$B$2:$P$16,VLOOKUP(Scorekeeping!W68,'Standard Board Scores'!$R:$U,3,FALSE),VLOOKUP(Scorekeeping!W68,'Standard Board Scores'!$R:$U,4,FALSE)),\"\")),\"\")),\"\")","v":""},{"$f":"IF(W69<>\"\",IF(IFERROR(IF(X68=\"\",\"\",IF(OR($D$9=\"Vertical\",$D$9=\"Single Letter\"),INDEX('Current Board'!$B$2:$P$16,VLOOKUP(Scorekeeping!X68,'Standard Board Scores'!$R:$U,3,FALSE),VLOOKUP(Scorekeeping!X68,'Standard Board Scores'!$R:$U,4,FALSE)),\"\")),\"\")=0,\"\",IFERROR(IF(ISERROR(X68),\"\",IF(OR($D$9=\"Vertical\",$D$9=\"Single Letter\"),INDEX('Current Board'!$B$2:$P$16,VLOOKUP(Scorekeeping!X68,'Standard Board Scores'!$R:$U,3,FALSE),VLOOKUP(Scorekeeping!X68,'Standard Board Scores'!$R:$U,4,FALSE)),\"\")),\"\")),\"\")","v":""},{"$f":"IF(X69<>\"\",IF(IFERROR(IF(Y68=\"\",\"\",IF(OR($D$9=\"Vertical\",$D$9=\"Single Letter\"),INDEX('Current Board'!$B$2:$P$16,VLOOKUP(Scorekeeping!Y68,'Standard Board Scores'!$R:$U,3,FALSE),VLOOKUP(Scorekeeping!Y68,'Standard Board Scores'!$R:$U,4,FALSE)),\"\")),\"\")=0,\"\",IFERROR(IF(ISERROR(Y68),\"\",IF(OR($D$9=\"Vertical\",$D$9=\"Single Letter\"),INDEX('Current Board'!$B$2:$P$16,VLOOKUP(Scorekeeping!Y68,'Standard Board Scores'!$R:$U,3,FALSE),VLOOKUP(Scorekeeping!Y68,'Standard Board Scores'!$R:$U,4,FALSE)),\"\")),\"\")),\"\")","v":""}]
[null,null,null,null,null,null,null,null,null,null,{"$f":"IFERROR(VLOOKUP(K69,'Tiles Remaining'!$A:$C,3,FALSE),\"\")","v":""},{"$f":"IFERROR(VLOOKUP(L69,'Tiles Remaining'!$A:$C,3,FALSE),\"\")","v":""},{"$f":"IFERROR(VLOOKUP(M69,'Tiles Remaining'!$A:$C,3,FALSE),\"\")","v":""},{"$f":"IFERROR(VLOOKUP(N69,'Tiles Remaining'!$A:$C,3,FALSE),\"\")","v":""},{"$f":"IFERROR(VLOOKUP(O69,'Tiles Remaining'!$A:$C,3,FALSE),\"\")","v":""},{"$f":"IFERROR(VLOOKUP(P69,'Tiles Remaining'!$A:$C,3,FALSE),\"\")","v":""},{"$f":"IFERROR(VLOOKUP(Q69,'Tiles Remaining'!$A:$C,3,FALSE),\"\")","v":""},{"$f":"IFERROR(VLOOKUP(R69,'Tiles Remaining'!$A:$C,3,FALSE),\"\")","v":""},{"$f":"IFERROR(VLOOKUP(S69,'Tiles Remaining'!$A:$C,3,FALSE),\"\")","v":""},{"$f":"IFERROR(VLOOKUP(T69,'Tiles Remaining'!$A:$C,3,FALSE),\"\")","v":""},{"$f":"IFERROR(VLOOKUP(U69,'Tiles Remaining'!$A:$C,3,FALSE),\"\")","v":""},{"$f":"IFERROR(VLOOKUP(V69,'Tiles Remaining'!$A:$C,3,FALSE),\"\")","v":""},{"$f":"IFERROR(VLOOKUP(W69,'Tiles Remaining'!$A:$C,3,FALSE),\"\")","v":""},{"$f":"IFERROR(VLOOKUP(X69,'Tiles Remaining'!$A:$C,3,FALSE),\"\")","v":""},{"$f":"IFERROR(VLOOKUP(Y69,'Tiles Remaining'!$A:$C,3,FALSE),\"\")","v":""},{"$f":"SUM(K70:Y70)","v":0}]
[null,null,null,null,null,null,null,null,null,null,null,"Vertical 12 - Side B"]
[null,null,null,null,null,null,null,null,null,null,null,1,2,3,4,5,6,7,8,9,10,11,12,13,14]
[null,null,null,null,null,null,null,null,null,null,{"$f":"IF(IFERROR(IF(K72=\"\",\"\",IF(OR($D$9=\"Vertical\",$D$9=\"Single Letter\"),INDEX('Current Board'!$B$2:$P$16,VLOOKUP(Scorekeeping!K72,'Standard Board Scores'!$R:$U,3,FALSE),VLOOKUP(Scorekeeping!K72,'Standard Board Scores'!$R:$U,4,FALSE)),\"\")),\"\")=0,\"\",IFERROR(IF(ISERROR(K72),\"\",IF(OR($D$9=\"Vertical\",$D$9=\"Single Letter\"),INDEX('Current Board'!$B$2:$P$16,VLOOKUP(Scorekeeping!K72,'Standard Board Scores'!$R:$U,3,FALSE),VLOOKUP(Scorekeeping!K72,'Standard Board Scores'!$R:$U,4,FALSE)),\"\")),\"\"))","v":""},{"$f":"IF(AND(K73<>\"\",LEFT(K73,1)<>\"P\",LEFT(K73,1)<>\"Q\"),CONCATENATE(CHAR(CODE(LEFT(K73,1))+1),REPLACE(K73,1,1,\"\")),\"\")","v":""},{"$f":"IF(AND(L73<>\"\",LEFT(L73,1)<>\"P\",LEFT(L73,1)<>\"Q\"),CONCATENATE(CHAR(CODE(LEFT(L73,1))+1),REPLACE(L73,1,1,\"\")),\"\")","v":""},"","","","","","","","","","","",""]
[null,null,null,null,null,null,null,null,null,null,null,{"$f":"IF(K74<>\"\",IF(IFERROR(IF(L73=\"\",\"\",IF(OR($D$9=\"Vertical\",$D$9=\"Single Letter\"),INDEX('Current Board'!$B$2:$P$16,VLOOKUP(Scorekeeping!L73,'Standard Board Scores'!$R:$U,3,FALSE),VLOOKUP(Scorekeeping!L73,'Standard Board Scores'!$R:$U,4,FALSE)),\"\")),\"\")=0,\"\",IFERROR(IF(ISERROR(L73),\"\",IF(OR($D$9=\"Vertical\",$D$9=\"Single Letter\"),INDEX('Current Board'!$B$2:$P$16,VLOOKUP(Scorekeeping!L73,'Standard Board Scores'!$R:$U,3,FALSE),VLOOKUP(Scorekeeping!L73,'Standard Board Scores'!$R:$U,4,FALSE)),\"\")),\"\")),\"\")","v":""},{"$f":"IF(L74<>\"\",IF(IFERROR(IF(M73=\"\",\"\",IF(OR($D$9=\"Vertical\",$D$9=\"Single Letter\"),INDEX('Current Board'!$B$2:$P$16,VLOOKUP(Scorekeeping!M73,'Standard Board Scores'!$R:$U,3,FALSE),VLOOKUP(Scorekeeping!M73,'Standard Board Scores'!$R:$U,4,FALSE)),\"\")),\"\")=0,\"\",IFERROR(IF(ISERROR(M73),\"\",IF(OR($D$9=\"Vertical\",$D$9=\"Single Letter\"),INDEX('Current Board'!$B$2:$P$16,VLOOKUP(Scorekeeping!M73,'Standard Board Scores'!$R:$U,3,FALSE),VLOOKUP(Scorekeeping!M73,'Standard Board Scores'!$R:$U,4,FALSE)),\"\")),\"\")),\"\")","v":""},{"$f":"IF(M74<>\"\",IF(IFERROR(IF(N73=\"\",\"\",IF(OR($D$9=\"Vertical\",$D$9=\"Single Letter\"),INDEX('Current Board'!$B$2:$P$16,VLOOKUP(Scorekeeping!N73,'Standard Board Scores'!$R:$U,3,FALSE),VLOOKUP(Scorekeeping!N73,'Standard Board Scores'!$R:$U,4,FALSE)),\"\")),\"\")=0,\"\",IFERROR(IF(ISERROR(N73),\"\",IF(OR($D$9=\"Vertical\",$D$9=\"Single Letter\"),INDEX('Current Board'!$B$2:$P$16,VLOOKUP(Scorekeeping!N73,'Standard Board Scores'!$R:$U,3,FALSE),VLOOKUP(Scorekeeping!N73,'Standard Board Scores'!$R:$U,4,FALSE)),\"\")),\"\")),\"\")","v":""},{"$f":"IF(N74<>\"\",IF(IFERROR(IF(O73=\"\",\"\",IF(OR($D$9=\"Vertical\",$D$9=\"Single Letter\"),INDEX('Current Board'!$B$2:$P$16,VLOOKUP(Scorekeeping!O73,'Standard Board Scores'!$R:$U,3,FALSE),VLOOKUP(Scorekeeping!O73,'Standard Board Scores'!$R:$U,4,FALSE)),\"\")),\"\")=0,\"\",IFERROR(IF(ISERROR(O73),\"\",IF(OR($D$9=\"Vertical\",$D$9=\"Single Letter\"),INDEX('Current Board'!$B$2:$P$16,VLOOKUP(Scorekeeping!O73,'Standard Board Scores'!$R:$U,3,FALSE),VLOOKUP(Scorekeeping!O73,'Standard Board Scores'!$R:$U,4,FALSE)),\"\")),\"\")),\"\")","v":""},{"$f":"IF(O74<>\"\",IF(IFERROR(IF(P73=\"\",\"\",IF(OR($D$9=\"Vertical\",$D$9=\"Single Letter\"),INDEX('Current Board'!$B$2:$P$16,VLOOKUP(Scorekeeping!P73,'Standard Board Scores'!$R:$U,3,FALSE),VLOOKUP(Scorekeeping!P73,'Standard Board Scores'!$R:$U,4,FALSE)),\"\")),\"\")=0,\"\",IFERROR(IF(ISERROR(P73),\"\",IF(OR($D$9=\"Vertical\",$D$9=\"Single Letter\"),INDEX('Current Board'!$B$2:$P$16,VLOOKUP(Scorekeeping!P73,'Standard Board Scores'!$R:$U,3,FALSE),VLOOKUP(Scorekeeping!P73,'Standard Board Scores'!$R:$U,4,FALSE)),\"\")),\"\")),\"\")","v":""},{"$f":"IF(P74<>\"\",IF(IFERROR(IF(Q73=\"\",\"\",IF(OR($D$9=\"Vertical\",$D$9=\"Single Letter\"),INDEX('Current Board'!$B$2:$P$16,VLOOKUP(Scorekeeping!Q73,'Standard Board Scores'!$R:$U,3,FALSE),VLOOKUP(Scorekeeping!Q73,'Standard Board Scores'!$R:$U,4,FALSE)),\"\")),\"\")=0,\"\",IFERROR(IF(ISERROR(Q73),\"\",IF(OR($D$9=\"Vertical\",$D$9=\"Single Letter\"),INDEX('Current Board'!$B$2:$P$16,VLOOKUP(Scorekeeping!Q73,'Standard Board Scores'!$R:$U,3,FALSE),VLOOKUP(Scorekeeping!Q73,'Standard Board Scores'!$R:$U,4,FALSE)),\"\")),\"\")),\"\")","v":""},{"$f":"IF(Q74<>\"\",IF(IFERROR(IF(R73=\"\",\"\",IF(OR($D$9=\"Vertical\",$D$9=\"Single Letter\"),INDEX('Current Board'!$B$2:$P$16,VLOOKUP(Scorekeeping!R73,'Standard Board Scores'!$R:$U,3,FALSE),VLOOKUP(Scorekeeping!R73,'Standard Board Scores'!$R:$U,4,FALSE)),\"\")),\"\")=0,\"\",IFERROR(IF(ISERROR(R73),\"\",IF(OR($D$9=\"Vertical\",$D$9=\"Single Letter\"),INDEX('Current Board'!$B$2:$P$16,VLOOKUP(Scorekeeping!R73,'Standard Board Scores'!$R:$U,3,FALSE),VLOOKUP(Scorekeeping!R73,'Standard Board Scores'!$R:$U,4,FALSE)),\"\")),\"\")),\"\")","v":""},{"$f":"IF(R74<>\"\",IF(IFERROR(IF(S73=\"\",\"\",IF(OR($D$9=\"Vertical\",$D$9=\"Single Letter\"),INDEX('Current Board'!$B$2:$P$16,VLOOKUP(Scorekeeping!S73,'Standard Board Scores'!$R:$U,3,FALSE),VLOOKUP(Scorekeeping!S73,'Standard Board Scores'!$R:$U,4,FALSE)),\"\")),\"\")=0,\"\",IFERROR(IF(ISERROR(S73),\"\",IF(OR($D$9=\"Vertical\",$D$9=\"Single Letter\"),INDEX('Current Board'!$B$2:$P$16,VLOOKUP(Scorekeeping!S73,'Standard Board Scores'!$R:$U,3,FALSE),VLOOKUP(Scorekeeping!S73,'Standard Board Scores'!$R:$U,4,FALSE)),\"\")),\"\")),\"\")","v":""},{"$f":"IF(S74<>\"\",IF(IFERROR(IF(T73=\"\",\"\",IF(OR($D$9=\"Vertical\",$D$9=\"Single Letter\"),INDEX('Current Board'!$B$2:$P$16,VLOOKUP(Scorekeeping!T73,'Standard Board Scores'!$R:$U,3,FALSE),VLOOKUP(Scorekeeping!T73,'Standard Board Scores'!$R:$U,4,FALSE)),\"\")),\"\")=0,\"\",IFERROR(IF(ISERROR(T73),\"\",IF(OR($D$9=\"Vertical\",$D$9=\"Single Letter\"),INDEX('Current Board'!$B$2:$P$16,VLOOKUP(Scorekeeping!T73,'Standard Board Scores'!$R:$U,3,FALSE),VLOOKUP(Scorekeeping!T73,'Standard Board Scores'!$R:$U,4,FALSE)),\"\")),\"\")),\"\")","v":""},{"$f":"IF(T74<>\"\",IF(IFERROR(IF(U73=\"\",\"\",IF(OR($D$9=\"Vertical\",$D$9=\"Single Letter\"),INDEX('Current Board'!$B$2:$P$16,VLOOKUP(Scorekeeping!U73,'Standard Board Scores'!$R:$U,3,FALSE),VLOOKUP(Scorekeeping!U73,'Standard Board Scores'!$R:$U,4,FALSE)),\"\")),\"\")=0,\"\",IFERROR(IF(ISERROR(U73),\"\",IF(OR($D$9=\"Vertical\",$D$9=\"Single Letter\"),INDEX('Current Board'!$B$2:$P$16,VLOOKUP(Scorekeeping!U73,'Standard Board Scores'!$R:$U,3,FALSE),VLOOKUP(Scorekeeping!U73,'Standard Board Scores'!$R:$U,4,FALSE)),\"\")),\"\")),\"\")","v":""},{"$f":"IF(U74<>\"\",IF(IFERROR(IF(V73=\"\",\"\",IF(OR($D$9=\"Vertical\",$D$9=\"Single Letter\"),INDEX('Current Board'!$B$2:$P$16,VLOOKUP(Scorekeeping!V73,'Standard Board Scores'!$R:$U,3,FALSE),VLOOKUP(Scorekeeping!V73,'Standard Board Scores'!$R:$U,4,FALSE)),\"\")),\"\")=0,\"\",IFERROR(IF(ISERROR(V73),\"\",IF(OR($D$9=\"Vertical\",$D$9=\"Single Letter\"),INDEX('Current Board'!$B$2:$P$16,VLOOKUP(Scorekeeping!V73,'Standard Board Scores'!$R:$U,3,FALSE),VLOOKUP(Scorekeeping!V73,'Standard Board Scores'!$R:$U,4,FALSE)),\"\")),\"\")),\"\")","v":""},{"$f":"IF(V74<>\"\",IF(IFERROR(IF(W73=\"\",\"\",IF(OR($D$9=\"Vertical\",$D$9=\"Single Letter\"),INDEX('Current Board'!$B$2:$P$16,VLOOKUP(Scorekeeping!W73,'Standard Board Scores'!$R:$U,3,FALSE),VLOOKUP(Scorekeeping!W73,'Standard Board Scores'!$R:$U,4,FALSE)),\"\")),\"\")=0,\"\",IFERROR(IF(ISERROR(W73),\"\",IF(OR($D$9=\"Vertical\",$D$9=\"Single Letter\"),INDEX('Current Board'!$B$2:$P$16,VLOOKUP(Scorekeeping!W73,'Standard Board Scores'!$R:$U,3,FALSE),VLOOKUP(Scorekeeping!W73,'Standard Board Scores'!$R:$U,4,FALSE)),\"\")),\"\")),\"\")","v":""},{"$f":"IF(W74<>\"\",IF(IFERROR(IF(X73=\"\",\"\",IF(OR($D$9=\"Vertical\",$D$9=\"Single Letter\"),INDEX('Current Board'!$B$2:$P$16,VLOOKUP(Scorekeeping!X73,'Standard Board Scores'!$R:$U,3,FALSE),VLOOKUP(Scorekeeping!X73,'Standard Board Scores'!$R:$U,4,FALSE)),\"\")),\"\")=0,\"\",IFERROR(IF(ISERROR(X73),\"\",IF(OR($D$9=\"Vertical\",$D$9=\"Single Letter\"),INDEX('Current Board'!$B$2:$P$16,VLOOKUP(Scorekeeping!X73,'Standard Board Scores'!$R:$U,3,FALSE),VLOOKUP(Scorekeeping!X73,'Standard Board Scores'!$R:$U,4,FALSE)),\"\")),\"\")),\"\")","v":""},{"$f":"IF(X74<>\"\",IF(IFERROR(IF(Y73=\"\",\"\",IF(OR($D$9=\"Vertical\",$D$9=\"Single Letter\"),INDEX('Current Board'!$B$2:$P$16,VLOOKUP(Scorekeeping!Y73,'Standard Board Scores'!$R:$U,3,FALSE),VLOOKUP(Scorekeeping!Y73,'Standard Board Scores'!$R:$U,4,FALSE)),\"\")),\"\")=0,\"\",IFERROR(IF(ISERROR(Y73),\"\",IF(OR($D$9=\"Vertical\",$D$9=\"Single Letter\"),INDEX('Current Board'!$B$2:$P$16,VLOOKUP(Scorekeeping!Y73,'Standard Board Scores'!$R:$U,3,FALSE),VLOOKUP(Scorekeeping!Y73,'Standard Board Scores'!$R:$U,4,FALSE)),\"\")),\"\")),\"\")","v":""}]
[null,null,null,null,null,null,null,null,null,null,{"$f":"IFERROR(VLOOKUP(K74,'Tiles Remaining'!$A:$C,3,FALSE),\"\")","v":""},{"$f":"IFERROR(VLOOKUP(L74,'Tiles Remaining'!$A:$C,3,FALSE),\"\")","v":""},{"$f":"IFERROR(VLOOKUP(M74,'Tiles Remaining'!$A:$C,3,FALSE),\"\")","v":""},{"$f":"IFERROR(VLOOKUP(N74,'Tiles Remaining'!$A:$C,3,FALSE),\"\")","v":""},{"$f":"IFERROR(VLOOKUP(O74,'Tiles Remaining'!$A:$C,3,FALSE),\"\")","v":""},{"$f":"IFERROR(VLOOKUP(P74,'Tiles Remaining'!$A:$C,3,FALSE),\"\")","v":""},{"$f":"IFERROR(VLOOKUP(Q74,'Tiles Remaining'!$A:$C,3,FALSE),\"\")","v":""},{"$f":"IFERROR(VLOOKUP(R74,'Tiles Remaining'!$A:$C,3,FALSE),\"\")","v":""},{"$f":"IFERROR(VLOOKUP(S74,'Tiles Remaining'!$A:$C,3,FALSE),\"\")","v":""},{"$f":"IFERROR(VLOOKUP(T74,'Tiles Remaining'!$A:$C,3,FALSE),\"\")","v":""},{"$f":"IFERROR(VLOOKUP(U74,'Tiles Remaining'!$A:$C,3,FALSE),\"\")","v":""},{"$f":"IFERROR(VLOOKUP(V74,'Tiles Remaining'!$A:$C,3,FALSE),\"\")","v":""},{"$f":"IFERROR(VLOOKUP(W74,'Tiles Remaining'!$A:$C,3,FALSE),\"\")","v":""},{"$f":"IFERROR(VLOOKUP(X74,'Tiles Remaining'!$A:$C,3,FALSE),\"\")","v":""},{"$f":"IFERROR(VLOOKUP(Y74,'Tiles Remaining'!$A:$C,3,FALSE),\"\")","v":""},{"$f":"SUM(K75:Y75)","v":0}]
[null,null,null,null,null,null,null,null,null,null,null,"Vertical 13 - Side B"]
[null,null,null,null,null,null,null,null,null,null,null,1,2,3,4,5,6,7,8,9,10,11,12,13,14]
[null,null,null,null,null,null,null,null,null,null,{"$f":"IF(IFERROR(IF(K77=\"\",\"\",IF(OR($D$9=\"Vertical\",$D$9=\"Single Letter\"),INDEX('Current Board'!$B$2:$P$16,VLOOKUP(Scorekeeping!K77,'Standard Board Scores'!$R:$U,3,FALSE),VLOOKUP(Scorekeeping!K77,'Standard Board Scores'!$R:$U,4,FALSE)),\"\")),\"\")=0,\"\",IFERROR(IF(ISERROR(K77),\"\",IF(OR($D$9=\"Vertical\",$D$9=\"Single Letter\"),INDEX('Current Board'!$B$2:$P$16,VLOOKUP(Scorekeeping!K77,'Standard Board Scores'!$R:$U,3,FALSE),VLOOKUP(Scorekeeping!K77,'Standard Board Scores'!$R:$U,4,FALSE)),\"\")),\"\"))","v":""},{"$f":"IF(AND(K78<>\"\",LEFT(K78,1)<>\"P\",LEFT(K78,1)<>\"Q\"),CONCATENATE(CHAR(CODE(LEFT(K78,1))+1),REPLACE(K78,1,1,\"\")),\"\")","v":""},{"$f":"IF(AND(L78<>\"\",LEFT(L78,1)<>\"P\",LEFT(L78,1)<>\"Q\"),CONCATENATE(CHAR(CODE(LEFT(L78,1))+1),REPLACE(L78,1,1,\"\")),\"\")","v":""},"","","","","","","","","","","",""]
[null,null,null,null,null,null,null,null,null,null,null,{"$f":"IF(K79<>\"\",IF(IFERROR(IF(L78=\"\",\"\",IF(OR($D$9=\"Vertical\",$D$9=\"Single Letter\"),INDEX('Current Board'!$B$2:$P$16,VLOOKUP(Scorekeeping!L78,'Standard Board Scores'!$R:$U,3,FALSE),VLOOKUP(Scorekeeping!L78,'Standard Board Scores'!$R:$U,4,FALSE)),\"\")),\"\")=0,\"\",IFERROR(IF(ISERROR(L78),\"\",IF(OR($D$9=\"Vertical\",$D$9=\"Single Letter\"),INDEX('Current Board'!$B$2:$P$16,VLOOKUP(Scorekeeping!L78,'Standard Board Scores'!$R:$U,3,FALSE),VLOOKUP(Scorekeeping!L78,'Standard Board Scores'!$R:$U,4,FALSE)),\"\")),\"\")),\"\")","v":""},{"$f":"IF(L79<>\"\",IF(IFERROR(IF(M78=\"\",\"\",IF(OR($D$9=\"Vertical\",$D$9=\"Single Letter\"),INDEX('Current Board'!$B$2:$P$16,VLOOKUP(Scorekeeping!M78,'Standard Board Scores'!$R:$U,3,FALSE),VLOOKUP(Scorekeeping!M78,'Standard Board Scores'!$R:$U,4,FALSE)),\"\")),\"\")=0,\"\",IFERROR(IF(ISERROR(M78),\"\",IF(OR($D$9=\"Vertical\",$D$9=\"Single Letter\"),INDEX('Current Board'!$B$2:$P$16,VLOOKUP(Scorekeeping!M78,'Standard Board Scores'!$R:$U,3,FALSE),VLOOKUP(Scorekeeping!M78,'Standard Board Scores'!$R:$U,4,FALSE)),\"\")),\"\")),\"\")","v":""},{"$f":"IF(M79<>\"\",IF(IFERROR(IF(N78=\"\",\"\",IF(OR($D$9=\"Vertical\",$D$9=\"Single Letter\"),INDEX('Current Board'!$B$2:$P$16,VLOOKUP(Scorekeeping!N78,'Standard Board Scores'!$R:$U,3,FALSE),VLOOKUP(Scorekeeping!N78,'Standard Board Scores'!$R:$U,4,FALSE)),\"\")),\"\")=0,\"\",IFERROR(IF(ISERROR(N78),\"\",IF(OR($D$9=\"Vertical\",$D$9=\"Single Letter\"),INDEX('Current Board'!$B$2:$P$16,VLOOKUP(Scorekeeping!N78,'Standard Board Scores'!$R:$U,3,FALSE),VLOOKUP(Scorekeeping!N78,'Standard Board Scores'!$R:$U,4,FALSE)),\"\")),\"\")),\"\")","v":""},{"$f":"IF(N79<>\"\",IF(IFERROR(IF(O78=\"\",\"\",IF(OR($D$9=\"Vertical\",$D$9=\"Single Letter\"),INDEX('Current Board'!$B$2:$P$16,VLOOKUP(Scorekeeping!O78,'Standard Board Scores'!$R:$U,3,FALSE),VLOOKUP(Scorekeeping!O78,'Standard Board Scores'!$R:$U,4,FALSE)),\"\")),\"\")=0,\"\",IFERROR(IF(ISERROR(O78),\"\",IF(OR($D$9=\"Vertical\",$D$9=\"Single Letter\"),INDEX('Current Board'!$B$2:$P$16,VLOOKUP(Scorekeeping!O78,'Standard Board Scores'!$R:$U,3,FALSE),VLOOKUP(Scorekeeping!O78,'Standard Board Scores'!$R:$U,4,FALSE)),\"\")),\"\")),\"\")","v":""},{"$f":"IF(O79<>\"\",IF(IFERROR(IF(P78=\"\",\"\",IF(OR($D$9=\"Vertical\",$D$9=\"Single Letter\"),INDEX('Current Board'!$B$2:$P$16,VLOOKUP(Scorekeeping!P78,'Standard Board Scores'!$R:$U,3,FALSE),VLOOKUP(Scorekeeping!P78,'Standard Board Scores'!$R:$U,4,FALSE)),\"\")),\"\")=0,\"\",IFERROR(IF(ISERROR(P78),\"\",IF(OR($D$9=\"Vertical\",$D$9=\"Single Letter\"),INDEX('Current Board'!$B$2:$P$16,VLOOKUP(Scorekeeping!P78,'Standard Board Scores'!$R:$U,3,FALSE),VLOOKUP(Scorekeeping!P78,'Standard Board Scores'!$R:$U,4,FALSE)),\"\")),\"\")),\"\")","v":""},{"$f":"IF(P79<>\"\",IF(IFERROR(IF(Q78=\"\",\"\",IF(OR($D$9=\"Vertical\",$D$9=\"Single Letter\"),INDEX('Current Board'!$B$2:$P$16,VLOOKUP(Scorekeeping!Q78,'Standard Board Scores'!$R:$U,3,FALSE),VLOOKUP(Scorekeeping!Q78,'Standard Board Scores'!$R:$U,4,FALSE)),\"\")),\"\")=0,\"\",IFERROR(IF(ISERROR(Q78),\"\",IF(OR($D$9=\"Vertical\",$D$9=\"Single Letter\"),INDEX('Current Board'!$B$2:$P$16,VLOOKUP(Scorekeeping!Q78,'Standard Board Scores'!$R:$U,3,FALSE),VLOOKUP(Scorekeeping!Q78,'Standard Board Scores'!$R:$U,4,FALSE)),\"\")),\"\")),\"\")","v":""},{"$f":"IF(Q79<>\"\",IF(IFERROR(IF(R78=\"\",\"\",IF(OR($D$9=\"Vertical\",$D$9=\"Single Letter\"),INDEX('Current Board'!$B$2:$P$16,VLOOKUP(Scorekeeping!R78,'Standard Board Scores'!$R:$U,3,FALSE),VLOOKUP(Scorekeeping!R78,'Standard Board Scores'!$R:$U,4,FALSE)),\"\")),\"\")=0,\"\",IFERROR(IF(ISERROR(R78),\"\",IF(OR($D$9=\"Vertical\",$D$9=\"Single Letter\"),INDEX('Current Board'!$B$2:$P$16,VLOOKUP(Scorekeeping!R78,'Standard Board Scores'!$R:$U,3,FALSE),VLOOKUP(Scorekeeping!R78,'Standard Board Scores'!$R:$U,4,FALSE)),\"\")),\"\")),\"\")","v":""},{"$f":"IF(R79<>\"\",IF(IFERROR(IF(S78=\"\",\"\",IF(OR($D$9=\"Vertical\",$D$9=\"Single Letter\"),INDEX('Current Board'!$B$2:$P$16,VLOOKUP(Scorekeeping!S78,'Standard Board Scores'!$R:$U,3,FALSE),VLOOKUP(Scorekeeping!S78,'Standard Board Scores'!$R:$U,4,FALSE)),\"\")),\"\")=0,\"\",IFERROR(IF(ISERROR(S78),\"\",IF(OR($D$9=\"Vertical\",$D$9=\"Single Letter\"),INDEX('Current Board'!$B$2:$P$16,VLOOKUP(Scorekeeping!S78,'Standard Board Scores'!$R:$U,3,FALSE),VLOOKUP(Scorekeeping!S78,'Standard Board Scores'!$R:$U,4,FALSE)),\"\")),\"\")),\"\")","v":""},{"$f":"IF(S79<>\"\",IF(IFERROR(IF(T78=\"\",\"\",IF(OR($D$9=\"Vertical\",$D$9=\"Single Letter\"),INDEX('Current Board'!$B$2:$P$16,VLOOKUP(Scorekeeping!T78,'Standard Board Scores'!$R:$U,3,FALSE),VLOOKUP(Scorekeeping!T78,'Standard Board Scores'!$R:$U,4,FALSE)),\"\")),\"\")=0,\"\",IFERROR(IF(ISERROR(T78),\"\",IF(OR($D$9=\"Vertical\",$D$9=\"Single Letter\"),INDEX('Current Board'!$B$2:$P$16,VLOOKUP(Scorekeeping!T78,'Standard Board Scores'!$R:$U,3,FALSE),VLOOKUP(Scorekeeping!T78,'Standard Board Scores'!$R:$U,4,FALSE)),\"\")),\"\")),\"\")","v":""},{"$f":"IF(T79<>\"\",IF(IFERROR(IF(U78=\"\",\"\",IF(OR($D$9=\"Vertical\",$D$9=\"Single Letter\"),INDEX('Current Board'!$B$2:$P$16,VLOOKUP(Scorekeeping!U78,'Standard Board Scores'!$R:$U,3,FALSE),VLOOKUP(Scorekeeping!U78,'Standard Board Scores'!$R:$U,4,FALSE)),\"\")),\"\")=0,\"\",IFERROR(IF(ISERROR(U78),\"\",IF(OR($D$9=\"Vertical\",$D$9=\"Single Letter\"),INDEX('Current Board'!$B$2:$P$16,VLOOKUP(Scorekeeping!U78,'Standard Board Scores'!$R:$U,3,FALSE),VLOOKUP(Scorekeeping!U78,'Standard Board Scores'!$R:$U,4,FALSE)),\"\")),\"\")),\"\")","v":""},{"$f":"IF(U79<>\"\",IF(IFERROR(IF(V78=\"\",\"\",IF(OR($D$9=\"Vertical\",$D$9=\"Single Letter\"),INDEX('Current Board'!$B$2:$P$16,VLOOKUP(Scorekeeping!V78,'Standard Board Scores'!$R:$U,3,FALSE),VLOOKUP(Scorekeeping!V78,'Standard Board Scores'!$R:$U,4,FALSE)),\"\")),\"\")=0,\"\",IFERROR(IF(ISERROR(V78),\"\",IF(OR($D$9=\"Vertical\",$D$9=\"Single Letter\"),INDEX('Current Board'!$B$2:$P$16,VLOOKUP(Scorekeeping!V78,'Standard Board Scores'!$R:$U,3,FALSE),VLOOKUP(Scorekeeping!V78,'Standard Board Scores'!$R:$U,4,FALSE)),\"\")),\"\")),\"\")","v":""},{"$f":"IF(V79<>\"\",IF(IFERROR(IF(W78=\"\",\"\",IF(OR($D$9=\"Vertical\",$D$9=\"Single Letter\"),INDEX('Current Board'!$B$2:$P$16,VLOOKUP(Scorekeeping!W78,'Standard Board Scores'!$R:$U,3,FALSE),VLOOKUP(Scorekeeping!W78,'Standard Board Scores'!$R:$U,4,FALSE)),\"\")),\"\")=0,\"\",IFERROR(IF(ISERROR(W78),\"\",IF(OR($D$9=\"Vertical\",$D$9=\"Single Letter\"),INDEX('Current Board'!$B$2:$P$16,VLOOKUP(Scorekeeping!W78,'Standard Board Scores'!$R:$U,3,FALSE),VLOOKUP(Scorekeeping!W78,'Standard Board Scores'!$R:$U,4,FALSE)),\"\")),\"\")),\"\")","v":""},{"$f":"IF(W79<>\"\",IF(IFERROR(IF(X78=\"\",\"\",IF(OR($D$9=\"Vertical\",$D$9=\"Single Letter\"),INDEX('Current Board'!$B$2:$P$16,VLOOKUP(Scorekeeping!X78,'Standard Board Scores'!$R:$U,3,FALSE),VLOOKUP(Scorekeeping!X78,'Standard Board Scores'!$R:$U,4,FALSE)),\"\")),\"\")=0,\"\",IFERROR(IF(ISERROR(X78),\"\",IF(OR($D$9=\"Vertical\",$D$9=\"Single Letter\"),INDEX('Current Board'!$B$2:$P$16,VLOOKUP(Scorekeeping!X78,'Standard Board Scores'!$R:$U,3,FALSE),VLOOKUP(Scorekeeping!X78,'Standard Board Scores'!$R:$U,4,FALSE)),\"\")),\"\")),\"\")","v":""},{"$f":"IF(X79<>\"\",IF(IFERROR(IF(Y78=\"\",\"\",IF(OR($D$9=\"Vertical\",$D$9=\"Single Letter\"),INDEX('Current Board'!$B$2:$P$16,VLOOKUP(Scorekeeping!Y78,'Standard Board Scores'!$R:$U,3,FALSE),VLOOKUP(Scorekeeping!Y78,'Standard Board Scores'!$R:$U,4,FALSE)),\"\")),\"\")=0,\"\",IFERROR(IF(ISERROR(Y78),\"\",IF(OR($D$9=\"Vertical\",$D$9=\"Single Letter\"),INDEX('Current Board'!$B$2:$P$16,VLOOKUP(Scorekeeping!Y78,'Standard Board Scores'!$R:$U,3,FALSE),VLOOKUP(Scorekeeping!Y78,'Standard Board Scores'!$R:$U,4,FALSE)),\"\")),\"\")),\"\")","v":""}]
[null,null,null,null,null,null,null,null,null,null,{"$f":"IFERROR(VLOOKUP(K79,'Tiles Remaining'!$A:$C,3,FALSE),\"\")","v":""},{"$f":"IFERROR(VLOOKUP(L79,'Tiles Remaining'!$A:$C,3,FALSE),\"\")","v":""},{"$f":"IFERROR(VLOOKUP(M79,'Tiles Remaining'!$A:$C,3,FALSE),\"\")","v":""},{"$f":"IFERROR(VLOOKUP(N79,'Tiles Remaining'!$A:$C,3,FALSE),\"\")","v":""},{"$f":"IFERROR(VLOOKUP(O79,'Tiles Remaining'!$A:$C,3,FALSE),\"\")","v":""},{"$f":"IFERROR(VLOOKUP(P79,'Tiles Remaining'!$A:$C,3,FALSE),\"\")","v":""},{"$f":"IFERROR(VLOOKUP(Q79,'Tiles Remaining'!$A:$C,3,FALSE),\"\")","v":""},{"$f":"IFERROR(VLOOKUP(R79,'Tiles Remaining'!$A:$C,3,FALSE),\"\")","v":""},{"$f":"IFERROR(VLOOKUP(S79,'Tiles Remaining'!$A:$C,3,FALSE),\"\")","v":""},{"$f":"IFERROR(VLOOKUP(T79,'Tiles Remaining'!$A:$C,3,FALSE),\"\")","v":""},{"$f":"IFERROR(VLOOKUP(U79,'Tiles Remaining'!$A:$C,3,FALSE),\"\")","v":""},{"$f":"IFERROR(VLOOKUP(V79,'Tiles Remaining'!$A:$C,3,FALSE),\"\")","v":""},{"$f":"IFERROR(VLOOKUP(W79,'Tiles Remaining'!$A:$C,3,FALSE),\"\")","v":""},{"$f":"IFERROR(VLOOKUP(X79,'Tiles Remaining'!$A:$C,3,FALSE),\"\")","v":""},{"$f":"IFERROR(VLOOKUP(Y79,'Tiles Remaining'!$A:$C,3,FALSE),\"\")","v":""},{"$f":"SUM(K80:Y80)","v":0}]
[null,null,null,null,null,null,null,null,null,null,null,"Vertical 14 - Side B"]
[null,null,null,null,null,null,null,null,null,null,null,1,2,3,4,5,6,7,8,9,10,11,12,13,14]
[null,null,null,null,null,null,null,null,null,null,{"$f":"IF(IFERROR(IF(K82=\"\",\"\",IF(OR($D$9=\"Vertical\",$D$9=\"Single Letter\"),INDEX('Current Board'!$B$2:$P$16,VLOOKUP(Scorekeeping!K82,'Standard Board Scores'!$R:$U,3,FALSE),VLOOKUP(Scorekeeping!K82,'Standard Board Scores'!$R:$U,4,FALSE)),\"\")),\"\")=0,\"\",IFERROR(IF(ISERROR(K82),\"\",IF(OR($D$9=\"Vertical\",$D$9=\"Single Letter\"),INDEX('Current Board'!$B$2:$P$16,VLOOKUP(Scorekeeping!K82,'Standard Board Scores'!$R:$U,3,FALSE),VLOOKUP(Scorekeeping!K82,'Standard Board Scores'!$R:$U,4,FALSE)),\"\")),\"\"))","v":""},{"$f":"IF(AND(K83<>\"\",LEFT(K83,1)<>\"P\",LEFT(K83,1)<>\"Q\"),CONCATENATE(CHAR(CODE(LEFT(K83,1))+1),REPLACE(K83,1,1,\"\")),\"\")","v":""},{"$f":"IF(AND(L83<>\"\",LEFT(L83,1)<>\"P\",LEFT(L83,1)<>\"Q\"),CONCATENATE(CHAR(CODE(LEFT(L83,1))+1),REPLACE(L83,1,1,\"\")),\"\")","v":""},"","","","","","","","","","","",""]
[null,null,null,null,null,null,null,null,null,null,null,{"$f":"IF(K84<>\"\",IF(IFERROR(IF(L83=\"\",\"\",IF(OR($D$9=\"Vertical\",$D$9=\"Single Letter\"),INDEX('Current Board'!$B$2:$P$16,VLOOKUP(Scorekeeping!L83,'Standard Board Scores'!$R:$U,3,FALSE),VLOOKUP(Scorekeeping!L83,'Standard Board Scores'!$R:$U,4,FALSE)),\"\")),\"\")=0,\"\",IFERROR(IF(ISERROR(L83),\"\",IF(OR($D$9=\"Vertical\",$D$9=\"Single Letter\"),INDEX('Current Board'!$B$2:$P$16,VLOOKUP(Scorekeeping!L83,'Standard Board Scores'!$R:$U,3,FALSE),VLOOKUP(Scorekeeping!L83,'Standard Board Scores'!$R:$U,4,FALSE)),\"\")),\"\")),\"\")","v":""},{"$f":"IF(L84<>\"\",IF(IFERROR(IF(M83=\"\",\"\",IF(OR($D$9=\"Vertical\",$D$9=\"Single Letter\"),INDEX('Current Board'!$B$2:$P$16,VLOOKUP(Scorekeeping!M83,'Standard Board Scores'!$R:$U,3,FALSE),VLOOKUP(Scorekeeping!M83,'Standard Board Scores'!$R:$U,4,FALSE)),\"\")),\"\")=0,\"\",IFERROR(IF(ISERROR(M83),\"\",IF(OR($D$9=\"Vertical\",$D$9=\"Single Letter\"),INDEX('Current Board'!$B$2:$P$16,VLOOKUP(Scorekeeping!M83,'Standard Board Scores'!$R:$U,3,FALSE),VLOOKUP(Scorekeeping!M83,'Standard Board Scores'!$R:$U,4,FALSE)),\"\")),\"\")),\"\")","v":""},{"$f":"IF(M84<>\"\",IF(IFERROR(IF(N83=\"\",\"\",IF(OR($D$9=\"Vertical\",$D$9=\"Single Letter\"),INDEX('Current Board'!$B$2:$P$16,VLOOKUP(Scorekeeping!N83,'Standard Board Scores'!$R:$U,3,FALSE),VLOOKUP(Scorekeeping!N83,'Standard Board Scores'!$R:$U,4,FALSE)),\"\")),\"\")=0,\"\",IFERROR(IF(ISERROR(N83),\"\",IF(OR($D$9=\"Vertical\",$D$9=\"Single Letter\"),INDEX('Current Board'!$B$2:$P$16,VLOOKUP(Scorekeeping!N83,'Standard Board Scores'!$R:$U,3,FALSE),VLOOKUP(Scorekeeping!N83,'Standard Board Scores'!$R:$U,4,FALSE)),\"\")),\"\")),\"\")","v":""},{"$f":"IF(N84<>\"\",IF(IFERROR(IF(O83=\"\",\"\",IF(OR($D$9=\"Vertical\",$D$9=\"Single Letter\"),INDEX('Current Board'!$B$2:$P$16,VLOOKUP(Scorekeeping!O83,'Standard Board Scores'!$R:$U,3,FALSE),VLOOKUP(Scorekeeping!O83,'Standard Board Scores'!$R:$U,4,FALSE)),\"\")),\"\")=0,\"\",IFERROR(IF(ISERROR(O83),\"\",IF(OR($D$9=\"Vertical\",$D$9=\"Single Letter\"),INDEX('Current Board'!$B$2:$P$16,VLOOKUP(Scorekeeping!O83,'Standard Board Scores'!$R:$U,3,FALSE),VLOOKUP(Scorekeeping!O83,'Standard Board Scores'!$R:$U,4,FALSE)),\"\")),\"\")),\"\")","v":""},{"$f":"IF(O84<>\"\",IF(IFERROR(IF(P83=\"\",\"\",IF(OR($D$9=\"Vertical\",$D$9=\"Single Letter\"),INDEX('Current Board'!$B$2:$P$16,VLOOKUP(Scorekeeping!P83,'Standard Board Scores'!$R:$U,3,FALSE),VLOOKUP(Scorekeeping!P83,'Standard Board Scores'!$R:$U,4,FALSE)),\"\")),\"\")=0,\"\",IFERROR(IF(ISERROR(P83),\"\",IF(OR($D$9=\"Vertical\",$D$9=\"Single Letter\"),INDEX('Current Board'!$B$2:$P$16,VLOOKUP(Scorekeeping!P83,'Standard Board Scores'!$R:$U,3,FALSE),VLOOKUP(Scorekeeping!P83,'Standard Board Scores'!$R:$U,4,FALSE)),\"\")),\"\")),\"\")","v":""},{"$f":"IF(P84<>\"\",IF(IFERROR(IF(Q83=\"\",\"\",IF(OR($D$9=\"Vertical\",$D$9=\"Single Letter\"),INDEX('Current Board'!$B$2:$P$16,VLOOKUP(Scorekeeping!Q83,'Standard Board Scores'!$R:$U,3,FALSE),VLOOKUP(Scorekeeping!Q83,'Standard Board Scores'!$R:$U,4,FALSE)),\"\")),\"\")=0,\"\",IFERROR(IF(ISERROR(Q83),\"\",IF(OR($D$9=\"Vertical\",$D$9=\"Single Letter\"),INDEX('Current Board'!$B$2:$P$16,VLOOKUP(Scorekeeping!Q83,'Standard Board Scores'!$R:$U,3,FALSE),VLOOKUP(Scorekeeping!Q83,'Standard Board Scores'!$R:$U,4,FALSE)),\"\")),\"\")),\"\")","v":""},{"$f":"IF(Q84<>\"\",IF(IFERROR(IF(R83=\"\",\"\",IF(OR($D$9=\"Vertical\",$D$9=\"Single Letter\"),INDEX('Current Board'!$B$2:$P$16,VLOOKUP(Scorekeeping!R83,'Standard Board Scores'!$R:$U,3,FALSE),VLOOKUP(Scorekeeping!R83,'Standard Board Scores'!$R:$U,4,FALSE)),\"\")),\"\")=0,\"\",IFERROR(IF(ISERROR(R83),\"\",IF(OR($D$9=\"Vertical\",$D$9=\"Single Letter\"),INDEX('Current Board'!$B$2:$P$16,VLOOKUP(Scorekeeping!R83,'Standard Board Scores'!$R:$U,3,FALSE),VLOOKUP(Scorekeeping!R83,'Standard Board Scores'!$R:$U,4,FALSE)),\"\")),\"\")),\"\")","v":""},{"$f":"IF(R84<>\"\",IF(IFERROR(IF(S83=\"\",\"\",IF(OR($D$9=\"Vertical\",$D$9=\"Single Letter\"),INDEX('Current Board'!$B$2:$P$16,VLOOKUP(Scorekeeping!S83,'Standard Board Scores'!$R:$U,3,FALSE),VLOOKUP(Scorekeeping!S83,'Standard Board Scores'!$R:$U,4,FALSE)),\"\")),\"\")=0,\"\",IFERROR(IF(ISERROR(S83),\"\",IF(OR($D$9=\"Vertical\",$D$9=\"Single Letter\"),INDEX('Current Board'!$B$2:$P$16,VLOOKUP(Scorekeeping!S83,'Standard Board Scores'!$R:$U,3,FALSE),VLOOKUP(Scorekeeping!S83,'Standard Board Scores'!$R:$U,4,FALSE)),\"\")),\"\")),\"\")","v":""},{"$f":"IF(S84<>\"\",IF(IFERROR(IF(T83=\"\",\"\",IF(OR($D$9=\"Vertical\",$D$9=\"Single Letter\"),INDEX('Current Board'!$B$2:$P$16,VLOOKUP(Scorekeeping!T83,'Standard Board Scores'!$R:$U,3,FALSE),VLOOKUP(Scorekeeping!T83,'Standard Board Scores'!$R:$U,4,FALSE)),\"\")),\"\")=0,\"\",IFERROR(IF(ISERROR(T83),\"\",IF(OR($D$9=\"Vertical\",$D$9=\"Single Letter\"),INDEX('Current Board'!$B$2:$P$16,VLOOKUP(Scorekeeping!T83,'Standard Board Scores'!$R:$U,3,FALSE),VLOOKUP(Scorekeeping!T83,'Standard Board Scores'!$R:$U,4,FALSE)),\"\")),\"\")),\"\")","v":""},{"$f":"IF(T84<>\"\",IF(IFERROR(IF(U83=\"\",\"\",IF(OR($D$9=\"Vertical\",$D$9=\"Single Letter\"),INDEX('Current Board'!$B$2:$P$16,VLOOKUP(Scorekeeping!U83,'Standard Board Scores'!$R:$U,3,FALSE),VLOOKUP(Scorekeeping!U83,'Standard Board Scores'!$R:$U,4,FALSE)),\"\")),\"\")=0,\"\",IFERROR(IF(ISERROR(U83),\"\",IF(OR($D$9=\"Vertical\",$D$9=\"Single Letter\"),INDEX('Current Board'!$B$2:$P$16,VLOOKUP(Scorekeeping!U83,'Standard Board Scores'!$R:$U,3,FALSE),VLOOKUP(Scorekeeping!U83,'Standard Board Scores'!$R:$U,4,FALSE)),\"\")),\"\")),\"\")","v":""},{"$f":"IF(U84<>\"\",IF(IFERROR(IF(V83=\"\",\"\",IF(OR($D$9=\"Vertical\",$D$9=\"Single Letter\"),INDEX('Current Board'!$B$2:$P$16,VLOOKUP(Scorekeeping!V83,'Standard Board Scores'!$R:$U,3,FALSE),VLOOKUP(Scorekeeping!V83,'Standard Board Scores'!$R:$U,4,FALSE)),\"\")),\"\")=0,\"\",IFERROR(IF(ISERROR(V83),\"\",IF(OR($D$9=\"Vertical\",$D$9=\"Single Letter\"),INDEX('Current Board'!$B$2:$P$16,VLOOKUP(Scorekeeping!V83,'Standard Board Scores'!$R:$U,3,FALSE),VLOOKUP(Scorekeeping!V83,'Standard Board Scores'!$R:$U,4,FALSE)),\"\")),\"\")),\"\")","v":""},{"$f":"IF(V84<>\"\",IF(IFERROR(IF(W83=\"\",\"\",IF(OR($D$9=\"Vertical\",$D$9=\"Single Letter\"),INDEX('Current Board'!$B$2:$P$16,VLOOKUP(Scorekeeping!W83,'Standard Board Scores'!$R:$U,3,FALSE),VLOOKUP(Scorekeeping!W83,'Standard Board Scores'!$R:$U,4,FALSE)),\"\")),\"\")=0,\"\",IFERROR(IF(ISERROR(W83),\"\",IF(OR($D$9=\"Vertical\",$D$9=\"Single Letter\"),INDEX('Current Board'!$B$2:$P$16,VLOOKUP(Scorekeeping!W83,'Standard Board Scores'!$R:$U,3,FALSE),VLOOKUP(Scorekeeping!W83,'Standard Board Scores'!$R:$U,4,FALSE)),\"\")),\"\")),\"\")","v":""},{"$f":"IF(W84<>\"\",IF(IFERROR(IF(X83=\"\",\"\",IF(OR($D$9=\"Vertical\",$D$9=\"Single Letter\"),INDEX('Current Board'!$B$2:$P$16,VLOOKUP(Scorekeeping!X83,'Standard Board Scores'!$R:$U,3,FALSE),VLOOKUP(Scorekeeping!X83,'Standard Board Scores'!$R:$U,4,FALSE)),\"\")),\"\")=0,\"\",IFERROR(IF(ISERROR(X83),\"\",IF(OR($D$9=\"Vertical\",$D$9=\"Single Letter\"),INDEX('Current Board'!$B$2:$P$16,VLOOKUP(Scorekeeping!X83,'Standard Board Scores'!$R:$U,3,FALSE),VLOOKUP(Scorekeeping!X83,'Standard Board Scores'!$R:$U,4,FALSE)),\"\")),\"\")),\"\")","v":""},{"$f":"IF(X84<>\"\",IF(IFERROR(IF(Y83=\"\",\"\",IF(OR($D$9=\"Vertical\",$D$9=\"Single Letter\"),INDEX('Current Board'!$B$2:$P$16,VLOOKUP(Scorekeeping!Y83,'Standard Board Scores'!$R:$U,3,FALSE),VLOOKUP(Scorekeeping!Y83,'Standard Board Scores'!$R:$U,4,FALSE)),\"\")),\"\")=0,\"\",IFERROR(IF(ISERROR(Y83),\"\",IF(OR($D$9=\"Vertical\",$D$9=\"Single Letter\"),INDEX('Current Board'!$B$2:$P$16,VLOOKUP(Scorekeeping!Y83,'Standard Board Scores'!$R:$U,3,FALSE),VLOOKUP(Scorekeeping!Y83,'Standard Board Scores'!$R:$U,4,FALSE)),\"\")),\"\")),\"\")","v":""}]
[null,null,null,null,null,null,null,null,null,null,{"$f":"IFERROR(VLOOKUP(K84,'Tiles Remaining'!$A:$C,3,FALSE),\"\")","v":""},{"$f":"IFERROR(VLOOKUP(L84,'Tiles Remaining'!$A:$C,3,FALSE),\"\")","v":""},{"$f":"IFERROR(VLOOKUP(M84,'Tiles Remaining'!$A:$C,3,FALSE),\"\")","v":""},{"$f":"IFERROR(VLOOKUP(N84,'Tiles Remaining'!$A:$C,3,FALSE),\"\")","v":""},{"$f":"IFERROR(VLOOKUP(O84,'Tiles Remaining'!$A:$C,3,FALSE),\"\")","v":""},{"$f":"IFERROR(VLOOKUP(P84,'Tiles Remaining'!$A:$C,3,FALSE),\"\")","v":""},{"$f":"IFERROR(VLOOKUP(Q84,'Tiles Remaining'!$A:$C,3,FALSE),\"\")","v":""},{"$f":"IFERROR(VLOOKUP(R84,'Tiles Remaining'!$A:$C,3,FALSE),\"\")","v":""},{"$f":"IFERROR(VLOOKUP(S84,'Tiles Remaining'!$A:$C,3,FALSE),\"\")","v":""},{"$f":"IFERROR(VLOOKUP(T84,'Tiles Remaining'!$A:$C,3,FALSE),\"\")","v":""},{"$f":"IFERROR(VLOOKUP(U84,'Tiles Remaining'!$A:$C,3,FALSE),\"\")","v":""},{"$f":"IFERROR(VLOOKUP(V84,'Tiles Remaining'!$A:$C,3,FALSE),\"\")","v":""},{"$f":"IFERROR(VLOOKUP(W84,'Tiles Remaining'!$A:$C,3,FALSE),\"\")","v":""},{"$f":"IFERROR(VLOOKUP(X84,'Tiles Remaining'!$A:$C,3,FALSE),\"\")","v":""},{"$f":"IFERROR(VLOOKUP(Y84,'Tiles Remaining'!$A:$C,3,FALSE),\"\")","v":""},{"$f":"SUM(K85:Y85)","v":0},{"$f":"SUM(Z16:Z85)","v":0}]
[null,null,null,null,null,null,null,null,null,null,null,"Vertical Top "]
[null,null,null,null,null,null,null,null,null,null,null,1,2,3,4,5,6,7,8,9,10,11,12,13,14]
[null,null,null,null,null,null,null,null,null,null,{"$f":"CONCATENATE(D22,E22,F22,G22,H22,I22,J22)","v":""},{"$f":"IF(AND(K88<>\"\",REPLACE(K88,1,1,\"\")<>\"2\",REPLACE(K88,1,1,\"\")<>\"1\"),CONCATENATE(LEFT(K88),VALUE(REPLACE(K88,1,1,\"\"))-1),\"\")","v":""},{"$f":"IF(AND(L88<>\"\",REPLACE(L88,1,1,\"\")<>\"2\",REPLACE(L88,1,1,\"\")<>\"1\"),CONCATENATE(LEFT(L88),VALUE(REPLACE(L88,1,1,\"\"))-1),\"\")","v":""},"","","","","","","","","","","",""]
[null,null,null,null,null,null,null,null,null,null,{"$f":"IF(IFERROR(IF(K88=\"\",\"\",IF(OR($D$9=\"Vertical\",$D$9=\"Single Letter\"),INDEX('Current Board'!$B$2:$P$16,VLOOKUP(Scorekeeping!K88,'Standard Board Scores'!$R:$U,3,FALSE),VLOOKUP(Scorekeeping!K88,'Standard Board Scores'!$R:$U,4,FALSE)),\"\")),\"\")=0,\"\",IFERROR(IF(ISERROR(K88),\"\",IF(OR($D$9=\"Vertical\",$D$9=\"Single Letter\"),INDEX('Current Board'!$B$2:$P$16,VLOOKUP(Scorekeeping!K88,'Standard Board Scores'!$R:$U,3,FALSE),VLOOKUP(Scorekeeping!K88,'Standard Board Scores'!$R:$U,4,FALSE)),\"\")),\"\"))","v":""},{"$f":"IF(K89<>\"\",IF(IFERROR(IF(L88=\"\",\"\",IF(OR($D$9=\"Vertical\",$D$9=\"Single Letter\"),INDEX('Current Board'!$B$2:$P$16,VLOOKUP(Scorekeeping!L88,'Standard Board Scores'!$R:$U,3,FALSE),VLOOKUP(Scorekeeping!L88,'Standard Board Scores'!$R:$U,4,FALSE)),\"\")),\"\")=0,\"\",IFERROR(IF(ISERROR(L88),\"\",IF(OR($D$9=\"Vertical\",$D$9=\"Single Letter\"),INDEX('Current Board'!$B$2:$P$16,VLOOKUP(Scorekeeping!L88,'Standard Board Scores'!$R:$U,3,FALSE),VLOOKUP(Scorekeeping!L88,'Standard Board Scores'!$R:$U,4,FALSE)),\"\")),\"\")),\"\")","v":""},{"$f":"IF(L89<>\"\",IF(IFERROR(IF(M88=\"\",\"\",IF(OR($D$9=\"Vertical\",$D$9=\"Single Letter\"),INDEX('Current Board'!$B$2:$P$16,VLOOKUP(Scorekeeping!M88,'Standard Board Scores'!$R:$U,3,FALSE),VLOOKUP(Scorekeeping!M88,'Standard Board Scores'!$R:$U,4,FALSE)),\"\")),\"\")=0,\"\",IFERROR(IF(ISERROR(M88),\"\",IF(OR($D$9=\"Vertical\",$D$9=\"Single Letter\"),INDEX('Current Board'!$B$2:$P$16,VLOOKUP(Scorekeeping!M88,'Standard Board Scores'!$R:$U,3,FALSE),VLOOKUP(Scorekeeping!M88,'Standard Board Scores'!$R:$U,4,FALSE)),\"\")),\"\")),\"\")","v":""},{"$f":"IF(M89<>\"\",IF(IFERROR(IF(N88=\"\",\"\",IF(OR($D$9=\"Vertical\",$D$9=\"Single Letter\"),INDEX('Current Board'!$B$2:$P$16,VLOOKUP(Scorekeeping!N88,'Standard Board Scores'!$R:$U,3,FALSE),VLOOKUP(Scorekeeping!N88,'Standard Board Scores'!$R:$U,4,FALSE)),\"\")),\"\")=0,\"\",IFERROR(IF(ISERROR(N88),\"\",IF(OR($D$9=\"Vertical\",$D$9=\"Single Letter\"),INDEX('Current Board'!$B$2:$P$16,VLOOKUP(Scorekeeping!N88,'Standard Board Scores'!$R:$U,3,FALSE),VLOOKUP(Scorekeeping!N88,'Standard Board Scores'!$R:$U,4,FALSE)),\"\")),\"\")),\"\")","v":""},{"$f":"IF(N89<>\"\",IF(IFERROR(IF(O88=\"\",\"\",IF(OR($D$9=\"Vertical\",$D$9=\"Single Letter\"),INDEX('Current Board'!$B$2:$P$16,VLOOKUP(Scorekeeping!O88,'Standard Board Scores'!$R:$U,3,FALSE),VLOOKUP(Scorekeeping!O88,'Standard Board Scores'!$R:$U,4,FALSE)),\"\")),\"\")=0,\"\",IFERROR(IF(ISERROR(O88),\"\",IF(OR($D$9=\"Vertical\",$D$9=\"Single Letter\"),INDEX('Current Board'!$B$2:$P$16,VLOOKUP(Scorekeeping!O88,'Standard Board Scores'!$R:$U,3,FALSE),VLOOKUP(Scorekeeping!O88,'Standard Board Scores'!$R:$U,4,FALSE)),\"\")),\"\")),\"\")","v":""},{"$f":"IF(O89<>\"\",IF(IFERROR(IF(P88=\"\",\"\",IF(OR($D$9=\"Vertical\",$D$9=\"Single Letter\"),INDEX('Current Board'!$B$2:$P$16,VLOOKUP(Scorekeeping!P88,'Standard Board Scores'!$R:$U,3,FALSE),VLOOKUP(Scorekeeping!P88,'Standard Board Scores'!$R:$U,4,FALSE)),\"\")),\"\")=0,\"\",IFERROR(IF(ISERROR(P88),\"\",IF(OR($D$9=\"Vertical\",$D$9=\"Single Letter\"),INDEX('Current Board'!$B$2:$P$16,VLOOKUP(Scorekeeping!P88,'Standard Board Scores'!$R:$U,3,FALSE),VLOOKUP(Scorekeeping!P88,'Standard Board Scores'!$R:$U,4,FALSE)),\"\")),\"\")),\"\")","v":""},{"$f":"IF(P89<>\"\",IF(IFERROR(IF(Q88=\"\",\"\",IF(OR($D$9=\"Vertical\",$D$9=\"Single Letter\"),INDEX('Current Board'!$B$2:$P$16,VLOOKUP(Scorekeeping!Q88,'Standard Board Scores'!$R:$U,3,FALSE),VLOOKUP(Scorekeeping!Q88,'Standard Board Scores'!$R:$U,4,FALSE)),\"\")),\"\")=0,\"\",IFERROR(IF(ISERROR(Q88),\"\",IF(OR($D$9=\"Vertical\",$D$9=\"Single Letter\"),INDEX('Current Board'!$B$2:$P$16,VLOOKUP(Scorekeeping!Q88,'Standard Board Scores'!$R:$U,3,FALSE),VLOOKUP(Scorekeeping!Q88,'Standard Board Scores'!$R:$U,4,FALSE)),\"\")),\"\")),\"\")","v":""},{"$f":"IF(Q89<>\"\",IF(IFERROR(IF(R88=\"\",\"\",IF(OR($D$9=\"Vertical\",$D$9=\"Single Letter\"),INDEX('Current Board'!$B$2:$P$16,VLOOKUP(Scorekeeping!R88,'Standard Board Scores'!$R:$U,3,FALSE),VLOOKUP(Scorekeeping!R88,'Standard Board Scores'!$R:$U,4,FALSE)),\"\")),\"\")=0,\"\",IFERROR(IF(ISERROR(R88),\"\",IF(OR($D$9=\"Vertical\",$D$9=\"Single Letter\"),INDEX('Current Board'!$B$2:$P$16,VLOOKUP(Scorekeeping!R88,'Standard Board Scores'!$R:$U,3,FALSE),VLOOKUP(Scorekeeping!R88,'Standard Board Scores'!$R:$U,4,FALSE)),\"\")),\"\")),\"\")","v":""},{"$f":"IF(R89<>\"\",IF(IFERROR(IF(S88=\"\",\"\",IF(OR($D$9=\"Vertical\",$D$9=\"Single Letter\"),INDEX('Current Board'!$B$2:$P$16,VLOOKUP(Scorekeeping!S88,'Standard Board Scores'!$R:$U,3,FALSE),VLOOKUP(Scorekeeping!S88,'Standard Board Scores'!$R:$U,4,FALSE)),\"\")),\"\")=0,\"\",IFERROR(IF(ISERROR(S88),\"\",IF(OR($D$9=\"Vertical\",$D$9=\"Single Letter\"),INDEX('Current Board'!$B$2:$P$16,VLOOKUP(Scorekeeping!S88,'Standard Board Scores'!$R:$U,3,FALSE),VLOOKUP(Scorekeeping!S88,'Standard Board Scores'!$R:$U,4,FALSE)),\"\")),\"\")),\"\")","v":""},{"$f":"IF(S89<>\"\",IF(IFERROR(IF(T88=\"\",\"\",IF(OR($D$9=\"Vertical\",$D$9=\"Single Letter\"),INDEX('Current Board'!$B$2:$P$16,VLOOKUP(Scorekeeping!T88,'Standard Board Scores'!$R:$U,3,FALSE),VLOOKUP(Scorekeeping!T88,'Standard Board Scores'!$R:$U,4,FALSE)),\"\")),\"\")=0,\"\",IFERROR(IF(ISERROR(T88),\"\",IF(OR($D$9=\"Vertical\",$D$9=\"Single Letter\"),INDEX('Current Board'!$B$2:$P$16,VLOOKUP(Scorekeeping!T88,'Standard Board Scores'!$R:$U,3,FALSE),VLOOKUP(Scorekeeping!T88,'Standard Board Scores'!$R:$U,4,FALSE)),\"\")),\"\")),\"\")","v":""},{"$f":"IF(T89<>\"\",IF(IFERROR(IF(U88=\"\",\"\",IF(OR($D$9=\"Vertical\",$D$9=\"Single Letter\"),INDEX('Current Board'!$B$2:$P$16,VLOOKUP(Scorekeeping!U88,'Standard Board Scores'!$R:$U,3,FALSE),VLOOKUP(Scorekeeping!U88,'Standard Board Scores'!$R:$U,4,FALSE)),\"\")),\"\")=0,\"\",IFERROR(IF(ISERROR(U88),\"\",IF(OR($D$9=\"Vertical\",$D$9=\"Single Letter\"),INDEX('Current Board'!$B$2:$P$16,VLOOKUP(Scorekeeping!U88,'Standard Board Scores'!$R:$U,3,FALSE),VLOOKUP(Scorekeeping!U88,'Standard Board Scores'!$R:$U,4,FALSE)),\"\")),\"\")),\"\")","v":""},{"$f":"IF(U89<>\"\",IF(IFERROR(IF(V88=\"\",\"\",IF(OR($D$9=\"Vertical\",$D$9=\"Single Letter\"),INDEX('Current Board'!$B$2:$P$16,VLOOKUP(Scorekeeping!V88,'Standard Board Scores'!$R:$U,3,FALSE),VLOOKUP(Scorekeeping!V88,'Standard Board Scores'!$R:$U,4,FALSE)),\"\")),\"\")=0,\"\",IFERROR(IF(ISERROR(V88),\"\",IF(OR($D$9=\"Vertical\",$D$9=\"Single Letter\"),INDEX('Current Board'!$B$2:$P$16,VLOOKUP(Scorekeeping!V88,'Standard Board Scores'!$R:$U,3,FALSE),VLOOKUP(Scorekeeping!V88,'Standard Board Scores'!$R:$U,4,FALSE)),\"\")),\"\")),\"\")","v":""},{"$f":"IF(V89<>\"\",IF(IFERROR(IF(W88=\"\",\"\",IF(OR($D$9=\"Vertical\",$D$9=\"Single Letter\"),INDEX('Current Board'!$B$2:$P$16,VLOOKUP(Scorekeeping!W88,'Standard Board Scores'!$R:$U,3,FALSE),VLOOKUP(Scorekeeping!W88,'Standard Board Scores'!$R:$U,4,FALSE)),\"\")),\"\")=0,\"\",IFERROR(IF(ISERROR(W88),\"\",IF(OR($D$9=\"Vertical\",$D$9=\"Single Letter\"),INDEX('Current Board'!$B$2:$P$16,VLOOKUP(Scorekeeping!W88,'Standard Board Scores'!$R:$U,3,FALSE),VLOOKUP(Scorekeeping!W88,'Standard Board Scores'!$R:$U,4,FALSE)),\"\")),\"\")),\"\")","v":""},{"$f":"IF(W89<>\"\",IF(IFERROR(IF(X88=\"\",\"\",IF(OR($D$9=\"Vertical\",$D$9=\"Single Letter\"),INDEX('Current Board'!$B$2:$P$16,VLOOKUP(Scorekeeping!X88,'Standard Board Scores'!$R:$U,3,FALSE),VLOOKUP(Scorekeeping!X88,'Standard Board Scores'!$R:$U,4,FALSE)),\"\")),\"\")=0,\"\",IFERROR(IF(ISERROR(X88),\"\",IF(OR($D$9=\"Vertical\",$D$9=\"Single Letter\"),INDEX('Current Board'!$B$2:$P$16,VLOOKUP(Scorekeeping!X88,'Standard Board Scores'!$R:$U,3,FALSE),VLOOKUP(Scorekeeping!X88,'Standard Board Scores'!$R:$U,4,FALSE)),\"\")),\"\")),\"\")","v":""},{"$f":"IF(X89<>\"\",IF(IFERROR(IF(Y88=\"\",\"\",IF(OR($D$9=\"Vertical\",$D$9=\"Single Letter\"),INDEX('Current Board'!$B$2:$P$16,VLOOKUP(Scorekeeping!Y88,'Standard Board Scores'!$R:$U,3,FALSE),VLOOKUP(Scorekeeping!Y88,'Standard Board Scores'!$R:$U,4,FALSE)),\"\")),\"\")=0,\"\",IFERROR(IF(ISERROR(Y88),\"\",IF(OR($D$9=\"Vertical\",$D$9=\"Single Letter\"),INDEX('Current Board'!$B$2:$P$16,VLOOKUP(Scorekeeping!Y88,'Standard Board Scores'!$R:$U,3,FALSE),VLOOKUP(Scorekeeping!Y88,'Standard Board Scores'!$R:$U,4,FALSE)),\"\")),\"\")),\"\")","v":""}]
[null,null,null,null,null,null,null,null,null,null,{"$f":"IFERROR(VLOOKUP(K89,'Tiles Remaining'!$A:$C,3,FALSE),\"\")","v":""},{"$f":"IFERROR(VLOOKUP(L89,'Tiles Remaining'!$A:$C,3,FALSE),\"\")","v":""},{"$f":"IFERROR(VLOOKUP(M89,'Tiles Remaining'!$A:$C,3,FALSE),\"\")","v":""},{"$f":"IFERROR(VLOOKUP(N89,'Tiles Remaining'!$A:$C,3,FALSE),\"\")","v":""},{"$f":"IFERROR(VLOOKUP(O89,'Tiles Remaining'!$A:$C,3,FALSE),\"\")","v":""},{"$f":"IFERROR(VLOOKUP(P89,'Tiles Remaining'!$A:$C,3,FALSE),\"\")","v":""},{"$f":"IFERROR(VLOOKUP(Q89,'Tiles Remaining'!$A:$C,3,FALSE),\"\")","v":""},{"$f":"IFERROR(VLOOKUP(R89,'Tiles Remaining'!$A:$C,3,FALSE),\"\")","v":""},{"$f":"IFERROR(VLOOKUP(S89,'Tiles Remaining'!$A:$C,3,FALSE),\"\")","v":""},{"$f":"IFERROR(VLOOKUP(T89,'Tiles Remaining'!$A:$C,3,FALSE),\"\")","v":""},{"$f":"IFERROR(VLOOKUP(U89,'Tiles Remaining'!$A:$C,3,FALSE),\"\")","v":""},{"$f":"IFERROR(VLOOKUP(V89,'Tiles Remaining'!$A:$C,3,FALSE),\"\")","v":""},{"$f":"IFERROR(VLOOKUP(W89,'Tiles Remaining'!$A:$C,3,FALSE),\"\")","v":""},{"$f":"IFERROR(VLOOKUP(X89,'Tiles Remaining'!$A:$C,3,FALSE),\"\")","v":""},{"$f":"IFERROR(VLOOKUP(Y89,'Tiles Remaining'!$A:$C,3,FALSE),\"\")","v":""},{"$f":"SUM(K90:Y90)","v":0}]
[null,null,null,null,null,null,null,null,null,null,null,"Vertical Bottom"]
[null,null,null,null,null,null,null,null,null,null,null,1,2,3,4,5,6,7,8,9,10,11,12,13,14]
[null,null,null,null,null,null,null,null,null,null,{"$f":"CONCATENATE(D24,E24,F24,G24,H24,I24,J24)","v":""},{"$f":"IF(AND(K93<>\"\",REPLACE(K93,1,1,\"\")<>\"16\",REPLACE(K93,1,1,\"\")<>\"17\"),CONCATENATE(LEFT(K93),VALUE(REPLACE(K93,1,1,\"\"))+1),\"\")","v":""},{"$f":"IF(AND(L93<>\"\",REPLACE(L93,1,1,\"\")<>\"16\",REPLACE(L93,1,1,\"\")<>\"17\"),CONCATENATE(LEFT(L93),VALUE(REPLACE(L93,1,1,\"\"))+1),\"\")","v":""},"","","","","","","","","","","",""]
[null,null,null,null,null,null,null,null,null,null,{"$f":"IF(IFERROR(IF(K93=\"\",\"\",IF(OR($D$9=\"Vertical\",$D$9=\"Single Letter\"),INDEX('Current Board'!$B$2:$P$16,VLOOKUP(Scorekeeping!K93,'Standard Board Scores'!$R:$U,3,FALSE),VLOOKUP(Scorekeeping!K93,'Standard Board Scores'!$R:$U,4,FALSE)),\"\")),\"\")=0,\"\",IFERROR(IF(ISERROR(K93),\"\",IF(OR($D$9=\"Vertical\",$D$9=\"Single Letter\"),INDEX('Current Board'!$B$2:$P$16,VLOOKUP(Scorekeeping!K93,'Standard Board Scores'!$R:$U,3,FALSE),VLOOKUP(Scorekeeping!K93,'Standard Board Scores'!$R:$U,4,FALSE)),\"\")),\"\"))","v":""},{"$f":"IF(K94<>\"\",IF(IFERROR(IF(L93=\"\",\"\",IF(OR($D$9=\"Vertical\",$D$9=\"Single Letter\"),INDEX('Current Board'!$B$2:$P$16,VLOOKUP(Scorekeeping!L93,'Standard Board Scores'!$R:$U,3,FALSE),VLOOKUP(Scorekeeping!L93,'Standard Board Scores'!$R:$U,4,FALSE)),\"\")),\"\")=0,\"\",IFERROR(IF(ISERROR(L93),\"\",IF(OR($D$9=\"Vertical\",$D$9=\"Single Letter\"),INDEX('Current Board'!$B$2:$P$16,VLOOKUP(Scorekeeping!L93,'Standard Board Scores'!$R:$U,3,FALSE),VLOOKUP(Scorekeeping!L93,'Standard Board Scores'!$R:$U,4,FALSE)),\"\")),\"\")),\"\")","v":""},{"$f":"IF(L94<>\"\",IF(IFERROR(IF(M93=\"\",\"\",IF(OR($D$9=\"Vertical\",$D$9=\"Single Letter\"),INDEX('Current Board'!$B$2:$P$16,VLOOKUP(Scorekeeping!M93,'Standard Board Scores'!$R:$U,3,FALSE),VLOOKUP(Scorekeeping!M93,'Standard Board Scores'!$R:$U,4,FALSE)),\"\")),\"\")=0,\"\",IFERROR(IF(ISERROR(M93),\"\",IF(OR($D$9=\"Vertical\",$D$9=\"Single Letter\"),INDEX('Current Board'!$B$2:$P$16,VLOOKUP(Scorekeeping!M93,'Standard Board Scores'!$R:$U,3,FALSE),VLOOKUP(Scorekeeping!M93,'Standard Board Scores'!$R:$U,4,FALSE)),\"\")),\"\")),\"\")","v":""},{"$f":"IF(M94<>\"\",IF(IFERROR(IF(N93=\"\",\"\",IF(OR($D$9=\"Vertical\",$D$9=\"Single Letter\"),INDEX('Current Board'!$B$2:$P$16,VLOOKUP(Scorekeeping!N93,'Standard Board Scores'!$R:$U,3,FALSE),VLOOKUP(Scorekeeping!N93,'Standard Board Scores'!$R:$U,4,FALSE)),\"\")),\"\")=0,\"\",IFERROR(IF(ISERROR(N93),\"\",IF(OR($D$9=\"Vertical\",$D$9=\"Single Letter\"),INDEX('Current Board'!$B$2:$P$16,VLOOKUP(Scorekeeping!N93,'Standard Board Scores'!$R:$U,3,FALSE),VLOOKUP(Scorekeeping!N93,'Standard Board Scores'!$R:$U,4,FALSE)),\"\")),\"\")),\"\")","v":""},{"$f":"IF(N94<>\"\",IF(IFERROR(IF(O93=\"\",\"\",IF(OR($D$9=\"Vertical\",$D$9=\"Single Letter\"),INDEX('Current Board'!$B$2:$P$16,VLOOKUP(Scorekeeping!O93,'Standard Board Scores'!$R:$U,3,FALSE),VLOOKUP(Scorekeeping!O93,'Standard Board Scores'!$R:$U,4,FALSE)),\"\")),\"\")=0,\"\",IFERROR(IF(ISERROR(O93),\"\",IF(OR($D$9=\"Vertical\",$D$9=\"Single Letter\"),INDEX('Current Board'!$B$2:$P$16,VLOOKUP(Scorekeeping!O93,'Standard Board Scores'!$R:$U,3,FALSE),VLOOKUP(Scorekeeping!O93,'Standard Board Scores'!$R:$U,4,FALSE)),\"\")),\"\")),\"\")","v":""},{"$f":"IF(O94<>\"\",IF(IFERROR(IF(P93=\"\",\"\",IF(OR($D$9=\"Vertical\",$D$9=\"Single Letter\"),INDEX('Current Board'!$B$2:$P$16,VLOOKUP(Scorekeeping!P93,'Standard Board Scores'!$R:$U,3,FALSE),VLOOKUP(Scorekeeping!P93,'Standard Board Scores'!$R:$U,4,FALSE)),\"\")),\"\")=0,\"\",IFERROR(IF(ISERROR(P93),\"\",IF(OR($D$9=\"Vertical\",$D$9=\"Single Letter\"),INDEX('Current Board'!$B$2:$P$16,VLOOKUP(Scorekeeping!P93,'Standard Board Scores'!$R:$U,3,FALSE),VLOOKUP(Scorekeeping!P93,'Standard Board Scores'!$R:$U,4,FALSE)),\"\")),\"\")),\"\")","v":""},{"$f":"IF(P94<>\"\",IF(IFERROR(IF(Q93=\"\",\"\",IF(OR($D$9=\"Vertical\",$D$9=\"Single Letter\"),INDEX('Current Board'!$B$2:$P$16,VLOOKUP(Scorekeeping!Q93,'Standard Board Scores'!$R:$U,3,FALSE),VLOOKUP(Scorekeeping!Q93,'Standard Board Scores'!$R:$U,4,FALSE)),\"\")),\"\")=0,\"\",IFERROR(IF(ISERROR(Q93),\"\",IF(OR($D$9=\"Vertical\",$D$9=\"Single Letter\"),INDEX('Current Board'!$B$2:$P$16,VLOOKUP(Scorekeeping!Q93,'Standard Board Scores'!$R:$U,3,FALSE),VLOOKUP(Scorekeeping!Q93,'Standard Board Scores'!$R:$U,4,FALSE)),\"\")),\"\")),\"\")","v":""},{"$f":"IF(Q94<>\"\",IF(IFERROR(IF(R93=\"\",\"\",IF(OR($D$9=\"Vertical\",$D$9=\"Single Letter\"),INDEX('Current Board'!$B$2:$P$16,VLOOKUP(Scorekeeping!R93,'Standard Board Scores'!$R:$U,3,FALSE),VLOOKUP(Scorekeeping!R93,'Standard Board Scores'!$R:$U,4,FALSE)),\"\")),\"\")=0,\"\",IFERROR(IF(ISERROR(R93),\"\",IF(OR($D$9=\"Vertical\",$D$9=\"Single Letter\"),INDEX('Current Board'!$B$2:$P$16,VLOOKUP(Scorekeeping!R93,'Standard Board Scores'!$R:$U,3,FALSE),VLOOKUP(Scorekeeping!R93,'Standard Board Scores'!$R:$U,4,FALSE)),\"\")),\"\")),\"\")","v":""},{"$f":"IF(R94<>\"\",IF(IFERROR(IF(S93=\"\",\"\",IF(OR($D$9=\"Vertical\",$D$9=\"Single Letter\"),INDEX('Current Board'!$B$2:$P$16,VLOOKUP(Scorekeeping!S93,'Standard Board Scores'!$R:$U,3,FALSE),VLOOKUP(Scorekeeping!S93,'Standard Board Scores'!$R:$U,4,FALSE)),\"\")),\"\")=0,\"\",IFERROR(IF(ISERROR(S93),\"\",IF(OR($D$9=\"Vertical\",$D$9=\"Single Letter\"),INDEX('Current Board'!$B$2:$P$16,VLOOKUP(Scorekeeping!S93,'Standard Board Scores'!$R:$U,3,FALSE),VLOOKUP(Scorekeeping!S93,'Standard Board Scores'!$R:$U,4,FALSE)),\"\")),\"\")),\"\")","v":""},{"$f":"IF(S94<>\"\",IF(IFERROR(IF(T93=\"\",\"\",IF(OR($D$9=\"Vertical\",$D$9=\"Single Letter\"),INDEX('Current Board'!$B$2:$P$16,VLOOKUP(Scorekeeping!T93,'Standard Board Scores'!$R:$U,3,FALSE),VLOOKUP(Scorekeeping!T93,'Standard Board Scores'!$R:$U,4,FALSE)),\"\")),\"\")=0,\"\",IFERROR(IF(ISERROR(T93),\"\",IF(OR($D$9=\"Vertical\",$D$9=\"Single Letter\"),INDEX('Current Board'!$B$2:$P$16,VLOOKUP(Scorekeeping!T93,'Standard Board Scores'!$R:$U,3,FALSE),VLOOKUP(Scorekeeping!T93,'Standard Board Scores'!$R:$U,4,FALSE)),\"\")),\"\")),\"\")","v":""},{"$f":"IF(T94<>\"\",IF(IFERROR(IF(U93=\"\",\"\",IF(OR($D$9=\"Vertical\",$D$9=\"Single Letter\"),INDEX('Current Board'!$B$2:$P$16,VLOOKUP(Scorekeeping!U93,'Standard Board Scores'!$R:$U,3,FALSE),VLOOKUP(Scorekeeping!U93,'Standard Board Scores'!$R:$U,4,FALSE)),\"\")),\"\")=0,\"\",IFERROR(IF(ISERROR(U93),\"\",IF(OR($D$9=\"Vertical\",$D$9=\"Single Letter\"),INDEX('Current Board'!$B$2:$P$16,VLOOKUP(Scorekeeping!U93,'Standard Board Scores'!$R:$U,3,FALSE),VLOOKUP(Scorekeeping!U93,'Standard Board Scores'!$R:$U,4,FALSE)),\"\")),\"\")),\"\")","v":""},{"$f":"IF(U94<>\"\",IF(IFERROR(IF(V93=\"\",\"\",IF(OR($D$9=\"Vertical\",$D$9=\"Single Letter\"),INDEX('Current Board'!$B$2:$P$16,VLOOKUP(Scorekeeping!V93,'Standard Board Scores'!$R:$U,3,FALSE),VLOOKUP(Scorekeeping!V93,'Standard Board Scores'!$R:$U,4,FALSE)),\"\")),\"\")=0,\"\",IFERROR(IF(ISERROR(V93),\"\",IF(OR($D$9=\"Vertical\",$D$9=\"Single Letter\"),INDEX('Current Board'!$B$2:$P$16,VLOOKUP(Scorekeeping!V93,'Standard Board Scores'!$R:$U,3,FALSE),VLOOKUP(Scorekeeping!V93,'Standard Board Scores'!$R:$U,4,FALSE)),\"\")),\"\")),\"\")","v":""},{"$f":"IF(V94<>\"\",IF(IFERROR(IF(W93=\"\",\"\",IF(OR($D$9=\"Vertical\",$D$9=\"Single Letter\"),INDEX('Current Board'!$B$2:$P$16,VLOOKUP(Scorekeeping!W93,'Standard Board Scores'!$R:$U,3,FALSE),VLOOKUP(Scorekeeping!W93,'Standard Board Scores'!$R:$U,4,FALSE)),\"\")),\"\")=0,\"\",IFERROR(IF(ISERROR(W93),\"\",IF(OR($D$9=\"Vertical\",$D$9=\"Single Letter\"),INDEX('Current Board'!$B$2:$P$16,VLOOKUP(Scorekeeping!W93,'Standard Board Scores'!$R:$U,3,FALSE),VLOOKUP(Scorekeeping!W93,'Standard Board Scores'!$R:$U,4,FALSE)),\"\")),\"\")),\"\")","v":""},{"$f":"IF(W94<>\"\",IF(IFERROR(IF(X93=\"\",\"\",IF(OR($D$9=\"Vertical\",$D$9=\"Single Letter\"),INDEX('Current Board'!$B$2:$P$16,VLOOKUP(Scorekeeping!X93,'Standard Board Scores'!$R:$U,3,FALSE),VLOOKUP(Scorekeeping!X93,'Standard Board Scores'!$R:$U,4,FALSE)),\"\")),\"\")=0,\"\",IFERROR(IF(ISERROR(X93),\"\",IF(OR($D$9=\"Vertical\",$D$9=\"Single Letter\"),INDEX('Current Board'!$B$2:$P$16,VLOOKUP(Scorekeeping!X93,'Standard Board Scores'!$R:$U,3,FALSE),VLOOKUP(Scorekeeping!X93,'Standard Board Scores'!$R:$U,4,FALSE)),\"\")),\"\")),\"\")","v":""},{"$f":"IF(X94<>\"\",IF(IFERROR(IF(Y93=\"\",\"\",IF(OR($D$9=\"Vertical\",$D$9=\"Single Letter\"),INDEX('Current Board'!$B$2:$P$16,VLOOKUP(Scorekeeping!Y93,'Standard Board Scores'!$R:$U,3,FALSE),VLOOKUP(Scorekeeping!Y93,'Standard Board Scores'!$R:$U,4,FALSE)),\"\")),\"\")=0,\"\",IFERROR(IF(ISERROR(Y93),\"\",IF(OR($D$9=\"Vertical\",$D$9=\"Single Letter\"),INDEX('Current Board'!$B$2:$P$16,VLOOKUP(Scorekeeping!Y93,'Standard Board Scores'!$R:$U,3,FALSE),VLOOKUP(Scorekeeping!Y93,'Standard Board Scores'!$R:$U,4,FALSE)),\"\")),\"\")),\"\")","v":""}]
[null,null,null,null,null,null,null,null,null,null,{"$f":"IFERROR(VLOOKUP(K94,'Tiles Remaining'!$A:$C,3,FALSE),\"\")","v":""},{"$f":"IFERROR(VLOOKUP(L94,'Tiles Remaining'!$A:$C,3,FALSE),\"\")","v":""},{"$f":"IFERROR(VLOOKUP(M94,'Tiles Remaining'!$A:$C,3,FALSE),\"\")","v":""},{"$f":"IFERROR(VLOOKUP(N94,'Tiles Remaining'!$A:$C,3,FALSE),\"\")","v":""},{"$f":"IFERROR(VLOOKUP(O94,'Tiles Remaining'!$A:$C,3,FALSE),\"\")","v":""},{"$f":"IFERROR(VLOOKUP(P94,'Tiles Remaining'!$A:$C,3,FALSE),\"\")","v":""},{"$f":"IFERROR(VLOOKUP(Q94,'Tiles Remaining'!$A:$C,3,FALSE),\"\")","v":""},{"$f":"IFERROR(VLOOKUP(R94,'Tiles Remaining'!$A:$C,3,FALSE),\"\")","v":""},{"$f":"IFERROR(VLOOKUP(S94,'Tiles Remaining'!$A:$C,3,FALSE),\"\")","v":""},{"$f":"IFERROR(VLOOKUP(T94,'Tiles Remaining'!$A:$C,3,FALSE),\"\")","v":""},{"$f":"IFERROR(VLOOKUP(U94,'Tiles Remaining'!$A:$C,3,FALSE),\"\")","v":""},{"$f":"IFERROR(VLOOKUP(V94,'Tiles Remaining'!$A:$C,3,FALSE),\"\")","v":""},{"$f":"IFERROR(VLOOKUP(W94,'Tiles Remaining'!$A:$C,3,FALSE),\"\")","v":""},{"$f":"IFERROR(VLOOKUP(X94,'Tiles Remaining'!$A:$C,3,FALSE),\"\")","v":""},{"$f":"IFERROR(VLOOKUP(Y94,'Tiles Remaining'!$A:$C,3,FALSE),\"\")","v":""},{"$f":"SUM(K95:Y95)","v":0}]
[null,null,null,null,null,null,null,null,null,null,null,"Horizontal 1 - Side A"]
[null,null,null,null,null,null,null,null,null,null,null,1,2,3,4,5,6,7,8,9,10,11,12,13,14]
[null,null,null,null,null,null,null,null,null,null,{"$f":"D26","v":""},{"$f":"IF(AND(K98<>\"\",REPLACE(K98,1,1,\"\")<>\"2\",REPLACE(K98,1,1,\"\")<>\"1\"),CONCATENATE(LEFT(K98),VALUE(REPLACE(K98,1,1,\"\"))-1),\"\")","v":""},{"$f":"IF(AND(L98<>\"\",REPLACE(L98,1,1,\"\")<>\"2\",REPLACE(L98,1,1,\"\")<>\"1\"),CONCATENATE(LEFT(L98),VALUE(REPLACE(L98,1,1,\"\"))-1),\"\")","v":""},"","","","","","","","","","","",""]
[null,null,null,null,null,null,null,null,null,null,{"$f":"IF(IFERROR(IF(K98=\"\",\"\",IF(OR($D$9=\"Horizontal\",$D$9=\"Single Letter\"),INDEX('Current Board'!$B$2:$P$16,VLOOKUP(Scorekeeping!K98,'Standard Board Scores'!$R:$U,3,FALSE),VLOOKUP(Scorekeeping!K98,'Standard Board Scores'!$R:$U,4,FALSE)),\"\")),\"\")=0,\"\",IFERROR(IF(ISERROR(K98),\"\",IF(OR($D$9=\"Horizontal\",$D$9=\"Single Letter\"),INDEX('Current Board'!$B$2:$P$16,VLOOKUP(Scorekeeping!K98,'Standard Board Scores'!$R:$U,3,FALSE),VLOOKUP(Scorekeeping!K98,'Standard Board Scores'!$R:$U,4,FALSE)),\"\")),\"\"))","v":""},{"$f":"IF(K99<>\"\",IF(IFERROR(IF(L98=\"\",\"\",IF(OR($D$9=\"Horizontal\",$D$9=\"Single Letter\"),INDEX('Current Board'!$B$2:$P$16,VLOOKUP(Scorekeeping!L98,'Standard Board Scores'!$R:$U,3,FALSE),VLOOKUP(Scorekeeping!L98,'Standard Board Scores'!$R:$U,4,FALSE)),\"\")),\"\")=0,\"\",IFERROR(IF(ISERROR(L98),\"\",IF(OR($D$9=\"Horizontal\",$D$9=\"Single Letter\"),INDEX('Current Board'!$B$2:$P$16,VLOOKUP(Scorekeeping!L98,'Standard Board Scores'!$R:$U,3,FALSE),VLOOKUP(Scorekeeping!L98,'Standard Board Scores'!$R:$U,4,FALSE)),\"\")),\"\")),\"\")","v":""},{"$f":"IF(L99<>\"\",IF(IFERROR(IF(M98=\"\",\"\",IF(OR($D$9=\"Horizontal\",$D$9=\"Single Letter\"),INDEX('Current Board'!$B$2:$P$16,VLOOKUP(Scorekeeping!M98,'Standard Board Scores'!$R:$U,3,FALSE),VLOOKUP(Scorekeeping!M98,'Standard Board Scores'!$R:$U,4,FALSE)),\"\")),\"\")=0,\"\",IFERROR(IF(ISERROR(M98),\"\",IF(OR($D$9=\"Horizontal\",$D$9=\"Single Letter\"),INDEX('Current Board'!$B$2:$P$16,VLOOKUP(Scorekeeping!M98,'Standard Board Scores'!$R:$U,3,FALSE),VLOOKUP(Scorekeeping!M98,'Standard Board Scores'!$R:$U,4,FALSE)),\"\")),\"\")),\"\")","v":""},{"$f":"IF(M99<>\"\",IF(IFERROR(IF(N98=\"\",\"\",IF(OR($D$9=\"Horizontal\",$D$9=\"Single Letter\"),INDEX('Current Board'!$B$2:$P$16,VLOOKUP(Scorekeeping!N98,'Standard Board Scores'!$R:$U,3,FALSE),VLOOKUP(Scorekeeping!N98,'Standard Board Scores'!$R:$U,4,FALSE)),\"\")),\"\")=0,\"\",IFERROR(IF(ISERROR(N98),\"\",IF(OR($D$9=\"Horizontal\",$D$9=\"Single Letter\"),INDEX('Current Board'!$B$2:$P$16,VLOOKUP(Scorekeeping!N98,'Standard Board Scores'!$R:$U,3,FALSE),VLOOKUP(Scorekeeping!N98,'Standard Board Scores'!$R:$U,4,FALSE)),\"\")),\"\")),\"\")","v":""},{"$f":"IF(N99<>\"\",IF(IFERROR(IF(O98=\"\",\"\",IF(OR($D$9=\"Horizontal\",$D$9=\"Single Letter\"),INDEX('Current Board'!$B$2:$P$16,VLOOKUP(Scorekeeping!O98,'Standard Board Scores'!$R:$U,3,FALSE),VLOOKUP(Scorekeeping!O98,'Standard Board Scores'!$R:$U,4,FALSE)),\"\")),\"\")=0,\"\",IFERROR(IF(ISERROR(O98),\"\",IF(OR($D$9=\"Horizontal\",$D$9=\"Single Letter\"),INDEX('Current Board'!$B$2:$P$16,VLOOKUP(Scorekeeping!O98,'Standard Board Scores'!$R:$U,3,FALSE),VLOOKUP(Scorekeeping!O98,'Standard Board Scores'!$R:$U,4,FALSE)),\"\")),\"\")),\"\")","v":""},{"$f":"IF(O99<>\"\",IF(IFERROR(IF(P98=\"\",\"\",IF(OR($D$9=\"Horizontal\",$D$9=\"Single Letter\"),INDEX('Current Board'!$B$2:$P$16,VLOOKUP(Scorekeeping!P98,'Standard Board Scores'!$R:$U,3,FALSE),VLOOKUP(Scorekeeping!P98,'Standard Board Scores'!$R:$U,4,FALSE)),\"\")),\"\")=0,\"\",IFERROR(IF(ISERROR(P98),\"\",IF(OR($D$9=\"Horizontal\",$D$9=\"Single Letter\"),INDEX('Current Board'!$B$2:$P$16,VLOOKUP(Scorekeeping!P98,'Standard Board Scores'!$R:$U,3,FALSE),VLOOKUP(Scorekeeping!P98,'Standard Board Scores'!$R:$U,4,FALSE)),\"\")),\"\")),\"\")","v":""},{"$f":"IF(P99<>\"\",IF(IFERROR(IF(Q98=\"\",\"\",IF(OR($D$9=\"Horizontal\",$D$9=\"Single Letter\"),INDEX('Current Board'!$B$2:$P$16,VLOOKUP(Scorekeeping!Q98,'Standard Board Scores'!$R:$U,3,FALSE),VLOOKUP(Scorekeeping!Q98,'Standard Board Scores'!$R:$U,4,FALSE)),\"\")),\"\")=0,\"\",IFERROR(IF(ISERROR(Q98),\"\",IF(OR($D$9=\"Horizontal\",$D$9=\"Single Letter\"),INDEX('Current Board'!$B$2:$P$16,VLOOKUP(Scorekeeping!Q98,'Standard Board Scores'!$R:$U,3,FALSE),VLOOKUP(Scorekeeping!Q98,'Standard Board Scores'!$R:$U,4,FALSE)),\"\")),\"\")),\"\")","v":""},{"$f":"IF(Q99<>\"\",IF(IFERROR(IF(R98=\"\",\"\",IF(OR($D$9=\"Horizontal\",$D$9=\"Single Letter\"),INDEX('Current Board'!$B$2:$P$16,VLOOKUP(Scorekeeping!R98,'Standard Board Scores'!$R:$U,3,FALSE),VLOOKUP(Scorekeeping!R98,'Standard Board Scores'!$R:$U,4,FALSE)),\"\")),\"\")=0,\"\",IFERROR(IF(ISERROR(R98),\"\",IF(OR($D$9=\"Horizontal\",$D$9=\"Single Letter\"),INDEX('Current Board'!$B$2:$P$16,VLOOKUP(Scorekeeping!R98,'Standard Board Scores'!$R:$U,3,FALSE),VLOOKUP(Scorekeeping!R98,'Standard Board Scores'!$R:$U,4,FALSE)),\"\")),\"\")),\"\")","v":""},{"$f":"IF(R99<>\"\",IF(IFERROR(IF(S98=\"\",\"\",IF(OR($D$9=\"Horizontal\",$D$9=\"Single Letter\"),INDEX('Current Board'!$B$2:$P$16,VLOOKUP(Scorekeeping!S98,'Standard Board Scores'!$R:$U,3,FALSE),VLOOKUP(Scorekeeping!S98,'Standard Board Scores'!$R:$U,4,FALSE)),\"\")),\"\")=0,\"\",IFERROR(IF(ISERROR(S98),\"\",IF(OR($D$9=\"Horizontal\",$D$9=\"Single Letter\"),INDEX('Current Board'!$B$2:$P$16,VLOOKUP(Scorekeeping!S98,'Standard Board Scores'!$R:$U,3,FALSE),VLOOKUP(Scorekeeping!S98,'Standard Board Scores'!$R:$U,4,FALSE)),\"\")),\"\")),\"\")","v":""},{"$f":"IF(S99<>\"\",IF(IFERROR(IF(T98=\"\",\"\",IF(OR($D$9=\"Horizontal\",$D$9=\"Single Letter\"),INDEX('Current Board'!$B$2:$P$16,VLOOKUP(Scorekeeping!T98,'Standard Board Scores'!$R:$U,3,FALSE),VLOOKUP(Scorekeeping!T98,'Standard Board Scores'!$R:$U,4,FALSE)),\"\")),\"\")=0,\"\",IFERROR(IF(ISERROR(T98),\"\",IF(OR($D$9=\"Horizontal\",$D$9=\"Single Letter\"),INDEX('Current Board'!$B$2:$P$16,VLOOKUP(Scorekeeping!T98,'Standard Board Scores'!$R:$U,3,FALSE),VLOOKUP(Scorekeeping!T98,'Standard Board Scores'!$R:$U,4,FALSE)),\"\")),\"\")),\"\")","v":""},{"$f":"IF(T99<>\"\",IF(IFERROR(IF(U98=\"\",\"\",IF(OR($D$9=\"Horizontal\",$D$9=\"Single Letter\"),INDEX('Current Board'!$B$2:$P$16,VLOOKUP(Scorekeeping!U98,'Standard Board Scores'!$R:$U,3,FALSE),VLOOKUP(Scorekeeping!U98,'Standard Board Scores'!$R:$U,4,FALSE)),\"\")),\"\")=0,\"\",IFERROR(IF(ISERROR(U98),\"\",IF(OR($D$9=\"Horizontal\",$D$9=\"Single Letter\"),INDEX('Current Board'!$B$2:$P$16,VLOOKUP(Scorekeeping!U98,'Standard Board Scores'!$R:$U,3,FALSE),VLOOKUP(Scorekeeping!U98,'Standard Board Scores'!$R:$U,4,FALSE)),\"\")),\"\")),\"\")","v":""},{"$f":"IF(U99<>\"\",IF(IFERROR(IF(V98=\"\",\"\",IF(OR($D$9=\"Horizontal\",$D$9=\"Single Letter\"),INDEX('Current Board'!$B$2:$P$16,VLOOKUP(Scorekeeping!V98,'Standard Board Scores'!$R:$U,3,FALSE),VLOOKUP(Scorekeeping!V98,'Standard Board Scores'!$R:$U,4,FALSE)),\"\")),\"\")=0,\"\",IFERROR(IF(ISERROR(V98),\"\",IF(OR($D$9=\"Horizontal\",$D$9=\"Single Letter\"),INDEX('Current Board'!$B$2:$P$16,VLOOKUP(Scorekeeping!V98,'Standard Board Scores'!$R:$U,3,FALSE),VLOOKUP(Scorekeeping!V98,'Standard Board Scores'!$R:$U,4,FALSE)),\"\")),\"\")),\"\")","v":""},{"$f":"IF(V99<>\"\",IF(IFERROR(IF(W98=\"\",\"\",IF(OR($D$9=\"Horizontal\",$D$9=\"Single Letter\"),INDEX('Current Board'!$B$2:$P$16,VLOOKUP(Scorekeeping!W98,'Standard Board Scores'!$R:$U,3,FALSE),VLOOKUP(Scorekeeping!W98,'Standard Board Scores'!$R:$U,4,FALSE)),\"\")),\"\")=0,\"\",IFERROR(IF(ISERROR(W98),\"\",IF(OR($D$9=\"Horizontal\",$D$9=\"Single Letter\"),INDEX('Current Board'!$B$2:$P$16,VLOOKUP(Scorekeeping!W98,'Standard Board Scores'!$R:$U,3,FALSE),VLOOKUP(Scorekeeping!W98,'Standard Board Scores'!$R:$U,4,FALSE)),\"\")),\"\")),\"\")","v":""},{"$f":"IF(W99<>\"\",IF(IFERROR(IF(X98=\"\",\"\",IF(OR($D$9=\"Horizontal\",$D$9=\"Single Letter\"),INDEX('Current Board'!$B$2:$P$16,VLOOKUP(Scorekeeping!X98,'Standard Board Scores'!$R:$U,3,FALSE),VLOOKUP(Scorekeeping!X98,'Standard Board Scores'!$R:$U,4,FALSE)),\"\")),\"\")=0,\"\",IFERROR(IF(ISERROR(X98),\"\",IF(OR($D$9=\"Horizontal\",$D$9=\"Single Letter\"),INDEX('Current Board'!$B$2:$P$16,VLOOKUP(Scorekeeping!X98,'Standard Board Scores'!$R:$U,3,FALSE),VLOOKUP(Scorekeeping!X98,'Standard Board Scores'!$R:$U,4,FALSE)),\"\")),\"\")),\"\")","v":""},{"$f":"IF(X99<>\"\",IF(IFERROR(IF(Y98=\"\",\"\",IF(OR($D$9=\"Horizontal\",$D$9=\"Single Letter\"),INDEX('Current Board'!$B$2:$P$16,VLOOKUP(Scorekeeping!Y98,'Standard Board Scores'!$R:$U,3,FALSE),VLOOKUP(Scorekeeping!Y98,'Standard Board Scores'!$R:$U,4,FALSE)),\"\")),\"\")=0,\"\",IFERROR(IF(ISERROR(Y98),\"\",IF(OR($D$9=\"Horizontal\",$D$9=\"Single Letter\"),INDEX('Current Board'!$B$2:$P$16,VLOOKUP(Scorekeeping!Y98,'Standard Board Scores'!$R:$U,3,FALSE),VLOOKUP(Scorekeeping!Y98,'Standard Board Scores'!$R:$U,4,FALSE)),\"\")),\"\")),\"\")","v":""}]
[null,null,null,null,null,null,null,null,null,null,{"$f":"IFERROR(VLOOKUP(K99,'Tiles Remaining'!$A:$C,3,FALSE),\"\")","v":""},{"$f":"IFERROR(VLOOKUP(L99,'Tiles Remaining'!$A:$C,3,FALSE),\"\")","v":""},{"$f":"IFERROR(VLOOKUP(M99,'Tiles Remaining'!$A:$C,3,FALSE),\"\")","v":""},{"$f":"IFERROR(VLOOKUP(N99,'Tiles Remaining'!$A:$C,3,FALSE),\"\")","v":""},{"$f":"IFERROR(VLOOKUP(O99,'Tiles Remaining'!$A:$C,3,FALSE),\"\")","v":""},{"$f":"IFERROR(VLOOKUP(P99,'Tiles Remaining'!$A:$C,3,FALSE),\"\")","v":""},{"$f":"IFERROR(VLOOKUP(Q99,'Tiles Remaining'!$A:$C,3,FALSE),\"\")","v":""},{"$f":"IFERROR(VLOOKUP(R99,'Tiles Remaining'!$A:$C,3,FALSE),\"\")","v":""},{"$f":"IFERROR(VLOOKUP(S99,'Tiles Remaining'!$A:$C,3,FALSE),\"\")","v":""},{"$f":"IFERROR(VLOOKUP(T99,'Tiles Remaining'!$A:$C,3,FALSE),\"\")","v":""},{"$f":"IFERROR(VLOOKUP(U99,'Tiles Remaining'!$A:$C,3,FALSE),\"\")","v":""},{"$f":"IFERROR(VLOOKUP(V99,'Tiles Remaining'!$A:$C,3,FALSE),\"\")","v":""},{"$f":"IFERROR(VLOOKUP(W99,'Tiles Remaining'!$A:$C,3,FALSE),\"\")","v":""},{"$f":"IFERROR(VLOOKUP(X99,'Tiles Remaining'!$A:$C,3,FALSE),\"\")","v":""},{"$f":"IFERROR(VLOOKUP(Y99,'Tiles Remaining'!$A:$C,3,FALSE),\"\")","v":""},{"$f":"SUM(K100:Y100)","v":0}]
[null,null,null,null,null,null,null,null,null,null,null,"Horizontal 2 - Side A"]
[null,null,null,null,null,null,null,null,null,null,null,1,2,3,4,5,6,7,8,9,10,11,12,13,14]
[null,null,null,null,null,null,null,null,null,null,{"$f":"E26","v":""},{"$f":"IF(AND(K103<>\"\",REPLACE(K103,1,1,\"\")<>\"2\",REPLACE(K103,1,1,\"\")<>\"1\"),CONCATENATE(LEFT(K103),VALUE(REPLACE(K103,1,1,\"\"))-1),\"\")","v":""},{"$f":"IF(AND(L103<>\"\",REPLACE(L103,1,1,\"\")<>\"2\",REPLACE(L103,1,1,\"\")<>\"1\"),CONCATENATE(LEFT(L103),VALUE(REPLACE(L103,1,1,\"\"))-1),\"\")","v":""},"","","","","","","","","","","",""]
[null,null,null,null,null,null,null,null,null,null,{"$f":"IF(IFERROR(IF(K103=\"\",\"\",IF(OR($D$9=\"Horizontal\",$D$9=\"Single Letter\"),INDEX('Current Board'!$B$2:$P$16,VLOOKUP(Scorekeeping!K103,'Standard Board Scores'!$R:$U,3,FALSE),VLOOKUP(Scorekeeping!K103,'Standard Board Scores'!$R:$U,4,FALSE)),\"\")),\"\")=0,\"\",IFERROR(IF(ISERROR(K103),\"\",IF(OR($D$9=\"Horizontal\",$D$9=\"Single Letter\"),INDEX('Current Board'!$B$2:$P$16,VLOOKUP(Scorekeeping!K103,'Standard Board Scores'!$R:$U,3,FALSE),VLOOKUP(Scorekeeping!K103,'Standard Board Scores'!$R:$U,4,FALSE)),\"\")),\"\"))","v":""},{"$f":"IF(K104<>\"\",IF(IFERROR(IF(L103=\"\",\"\",IF(OR($D$9=\"Horizontal\",$D$9=\"Single Letter\"),INDEX('Current Board'!$B$2:$P$16,VLOOKUP(Scorekeeping!L103,'Standard Board Scores'!$R:$U,3,FALSE),VLOOKUP(Scorekeeping!L103,'Standard Board Scores'!$R:$U,4,FALSE)),\"\")),\"\")=0,\"\",IFERROR(IF(ISERROR(L103),\"\",IF(OR($D$9=\"Horizontal\",$D$9=\"Single Letter\"),INDEX('Current Board'!$B$2:$P$16,VLOOKUP(Scorekeeping!L103,'Standard Board Scores'!$R:$U,3,FALSE),VLOOKUP(Scorekeeping!L103,'Standard Board Scores'!$R:$U,4,FALSE)),\"\")),\"\")),\"\")","v":""},{"$f":"IF(L104<>\"\",IF(IFERROR(IF(M103=\"\",\"\",IF(OR($D$9=\"Horizontal\",$D$9=\"Single Letter\"),INDEX('Current Board'!$B$2:$P$16,VLOOKUP(Scorekeeping!M103,'Standard Board Scores'!$R:$U,3,FALSE),VLOOKUP(Scorekeeping!M103,'Standard Board Scores'!$R:$U,4,FALSE)),\"\")),\"\")=0,\"\",IFERROR(IF(ISERROR(M103),\"\",IF(OR($D$9=\"Horizontal\",$D$9=\"Single Letter\"),INDEX('Current Board'!$B$2:$P$16,VLOOKUP(Scorekeeping!M103,'Standard Board Scores'!$R:$U,3,FALSE),VLOOKUP(Scorekeeping!M103,'Standard Board Scores'!$R:$U,4,FALSE)),\"\")),\"\")),\"\")","v":""},{"$f":"IF(M104<>\"\",IF(IFERROR(IF(N103=\"\",\"\",IF(OR($D$9=\"Horizontal\",$D$9=\"Single Letter\"),INDEX('Current Board'!$B$2:$P$16,VLOOKUP(Scorekeeping!N103,'Standard Board Scores'!$R:$U,3,FALSE),VLOOKUP(Scorekeeping!N103,'Standard Board Scores'!$R:$U,4,FALSE)),\"\")),\"\")=0,\"\",IFERROR(IF(ISERROR(N103),\"\",IF(OR($D$9=\"Horizontal\",$D$9=\"Single Letter\"),INDEX('Current Board'!$B$2:$P$16,VLOOKUP(Scorekeeping!N103,'Standard Board Scores'!$R:$U,3,FALSE),VLOOKUP(Scorekeeping!N103,'Standard Board Scores'!$R:$U,4,FALSE)),\"\")),\"\")),\"\")","v":""},{"$f":"IF(N104<>\"\",IF(IFERROR(IF(O103=\"\",\"\",IF(OR($D$9=\"Horizontal\",$D$9=\"Single Letter\"),INDEX('Current Board'!$B$2:$P$16,VLOOKUP(Scorekeeping!O103,'Standard Board Scores'!$R:$U,3,FALSE),VLOOKUP(Scorekeeping!O103,'Standard Board Scores'!$R:$U,4,FALSE)),\"\")),\"\")=0,\"\",IFERROR(IF(ISERROR(O103),\"\",IF(OR($D$9=\"Horizontal\",$D$9=\"Single Letter\"),INDEX('Current Board'!$B$2:$P$16,VLOOKUP(Scorekeeping!O103,'Standard Board Scores'!$R:$U,3,FALSE),VLOOKUP(Scorekeeping!O103,'Standard Board Scores'!$R:$U,4,FALSE)),\"\")),\"\")),\"\")","v":""},{"$f":"IF(O104<>\"\",IF(IFERROR(IF(P103=\"\",\"\",IF(OR($D$9=\"Horizontal\",$D$9=\"Single Letter\"),INDEX('Current Board'!$B$2:$P$16,VLOOKUP(Scorekeeping!P103,'Standard Board Scores'!$R:$U,3,FALSE),VLOOKUP(Scorekeeping!P103,'Standard Board Scores'!$R:$U,4,FALSE)),\"\")),\"\")=0,\"\",IFERROR(IF(ISERROR(P103),\"\",IF(OR($D$9=\"Horizontal\",$D$9=\"Single Letter\"),INDEX('Current Board'!$B$2:$P$16,VLOOKUP(Scorekeeping!P103,'Standard Board Scores'!$R:$U,3,FALSE),VLOOKUP(Scorekeeping!P103,'Standard Board Scores'!$R:$U,4,FALSE)),\"\")),\"\")),\"\")","v":""},{"$f":"IF(P104<>\"\",IF(IFERROR(IF(Q103=\"\",\"\",IF(OR($D$9=\"Horizontal\",$D$9=\"Single Letter\"),INDEX('Current Board'!$B$2:$P$16,VLOOKUP(Scorekeeping!Q103,'Standard Board Scores'!$R:$U,3,FALSE),VLOOKUP(Scorekeeping!Q103,'Standard Board Scores'!$R:$U,4,FALSE)),\"\")),\"\")=0,\"\",IFERROR(IF(ISERROR(Q103),\"\",IF(OR($D$9=\"Horizontal\",$D$9=\"Single Letter\"),INDEX('Current Board'!$B$2:$P$16,VLOOKUP(Scorekeeping!Q103,'Standard Board Scores'!$R:$U,3,FALSE),VLOOKUP(Scorekeeping!Q103,'Standard Board Scores'!$R:$U,4,FALSE)),\"\")),\"\")),\"\")","v":""},{"$f":"IF(Q104<>\"\",IF(IFERROR(IF(R103=\"\",\"\",IF(OR($D$9=\"Horizontal\",$D$9=\"Single Letter\"),INDEX('Current Board'!$B$2:$P$16,VLOOKUP(Scorekeeping!R103,'Standard Board Scores'!$R:$U,3,FALSE),VLOOKUP(Scorekeeping!R103,'Standard Board Scores'!$R:$U,4,FALSE)),\"\")),\"\")=0,\"\",IFERROR(IF(ISERROR(R103),\"\",IF(OR($D$9=\"Horizontal\",$D$9=\"Single Letter\"),INDEX('Current Board'!$B$2:$P$16,VLOOKUP(Scorekeeping!R103,'Standard Board Scores'!$R:$U,3,FALSE),VLOOKUP(Scorekeeping!R103,'Standard Board Scores'!$R:$U,4,FALSE)),\"\")),\"\")),\"\")","v":""},{"$f":"IF(R104<>\"\",IF(IFERROR(IF(S103=\"\",\"\",IF(OR($D$9=\"Horizontal\",$D$9=\"Single Letter\"),INDEX('Current Board'!$B$2:$P$16,VLOOKUP(Scorekeeping!S103,'Standard Board Scores'!$R:$U,3,FALSE),VLOOKUP(Scorekeeping!S103,'Standard Board Scores'!$R:$U,4,FALSE)),\"\")),\"\")=0,\"\",IFERROR(IF(ISERROR(S103),\"\",IF(OR($D$9=\"Horizontal\",$D$9=\"Single Letter\"),INDEX('Current Board'!$B$2:$P$16,VLOOKUP(Scorekeeping!S103,'Standard Board Scores'!$R:$U,3,FALSE),VLOOKUP(Scorekeeping!S103,'Standard Board Scores'!$R:$U,4,FALSE)),\"\")),\"\")),\"\")","v":""},{"$f":"IF(S104<>\"\",IF(IFERROR(IF(T103=\"\",\"\",IF(OR($D$9=\"Horizontal\",$D$9=\"Single Letter\"),INDEX('Current Board'!$B$2:$P$16,VLOOKUP(Scorekeeping!T103,'Standard Board Scores'!$R:$U,3,FALSE),VLOOKUP(Scorekeeping!T103,'Standard Board Scores'!$R:$U,4,FALSE)),\"\")),\"\")=0,\"\",IFERROR(IF(ISERROR(T103),\"\",IF(OR($D$9=\"Horizontal\",$D$9=\"Single Letter\"),INDEX('Current Board'!$B$2:$P$16,VLOOKUP(Scorekeeping!T103,'Standard Board Scores'!$R:$U,3,FALSE),VLOOKUP(Scorekeeping!T103,'Standard Board Scores'!$R:$U,4,FALSE)),\"\")),\"\")),\"\")","v":""},{"$f":"IF(T104<>\"\",IF(IFERROR(IF(U103=\"\",\"\",IF(OR($D$9=\"Horizontal\",$D$9=\"Single Letter\"),INDEX('Current Board'!$B$2:$P$16,VLOOKUP(Scorekeeping!U103,'Standard Board Scores'!$R:$U,3,FALSE),VLOOKUP(Scorekeeping!U103,'Standard Board Scores'!$R:$U,4,FALSE)),\"\")),\"\")=0,\"\",IFERROR(IF(ISERROR(U103),\"\",IF(OR($D$9=\"Horizontal\",$D$9=\"Single Letter\"),INDEX('Current Board'!$B$2:$P$16,VLOOKUP(Scorekeeping!U103,'Standard Board Scores'!$R:$U,3,FALSE),VLOOKUP(Scorekeeping!U103,'Standard Board Scores'!$R:$U,4,FALSE)),\"\")),\"\")),\"\")","v":""},{"$f":"IF(U104<>\"\",IF(IFERROR(IF(V103=\"\",\"\",IF(OR($D$9=\"Horizontal\",$D$9=\"Single Letter\"),INDEX('Current Board'!$B$2:$P$16,VLOOKUP(Scorekeeping!V103,'Standard Board Scores'!$R:$U,3,FALSE),VLOOKUP(Scorekeeping!V103,'Standard Board Scores'!$R:$U,4,FALSE)),\"\")),\"\")=0,\"\",IFERROR(IF(ISERROR(V103),\"\",IF(OR($D$9=\"Horizontal\",$D$9=\"Single Letter\"),INDEX('Current Board'!$B$2:$P$16,VLOOKUP(Scorekeeping!V103,'Standard Board Scores'!$R:$U,3,FALSE),VLOOKUP(Scorekeeping!V103,'Standard Board Scores'!$R:$U,4,FALSE)),\"\")),\"\")),\"\")","v":""},{"$f":"IF(V104<>\"\",IF(IFERROR(IF(W103=\"\",\"\",IF(OR($D$9=\"Horizontal\",$D$9=\"Single Letter\"),INDEX('Current Board'!$B$2:$P$16,VLOOKUP(Scorekeeping!W103,'Standard Board Scores'!$R:$U,3,FALSE),VLOOKUP(Scorekeeping!W103,'Standard Board Scores'!$R:$U,4,FALSE)),\"\")),\"\")=0,\"\",IFERROR(IF(ISERROR(W103),\"\",IF(OR($D$9=\"Horizontal\",$D$9=\"Single Letter\"),INDEX('Current Board'!$B$2:$P$16,VLOOKUP(Scorekeeping!W103,'Standard Board Scores'!$R:$U,3,FALSE),VLOOKUP(Scorekeeping!W103,'Standard Board Scores'!$R:$U,4,FALSE)),\"\")),\"\")),\"\")","v":""},{"$f":"IF(W104<>\"\",IF(IFERROR(IF(X103=\"\",\"\",IF(OR($D$9=\"Horizontal\",$D$9=\"Single Letter\"),INDEX('Current Board'!$B$2:$P$16,VLOOKUP(Scorekeeping!X103,'Standard Board Scores'!$R:$U,3,FALSE),VLOOKUP(Scorekeeping!X103,'Standard Board Scores'!$R:$U,4,FALSE)),\"\")),\"\")=0,\"\",IFERROR(IF(ISERROR(X103),\"\",IF(OR($D$9=\"Horizontal\",$D$9=\"Single Letter\"),INDEX('Current Board'!$B$2:$P$16,VLOOKUP(Scorekeeping!X103,'Standard Board Scores'!$R:$U,3,FALSE),VLOOKUP(Scorekeeping!X103,'Standard Board Scores'!$R:$U,4,FALSE)),\"\")),\"\")),\"\")","v":""},{"$f":"IF(X104<>\"\",IF(IFERROR(IF(Y103=\"\",\"\",IF(OR($D$9=\"Horizontal\",$D$9=\"Single Letter\"),INDEX('Current Board'!$B$2:$P$16,VLOOKUP(Scorekeeping!Y103,'Standard Board Scores'!$R:$U,3,FALSE),VLOOKUP(Scorekeeping!Y103,'Standard Board Scores'!$R:$U,4,FALSE)),\"\")),\"\")=0,\"\",IFERROR(IF(ISERROR(Y103),\"\",IF(OR($D$9=\"Horizontal\",$D$9=\"Single Letter\"),INDEX('Current Board'!$B$2:$P$16,VLOOKUP(Scorekeeping!Y103,'Standard Board Scores'!$R:$U,3,FALSE),VLOOKUP(Scorekeeping!Y103,'Standard Board Scores'!$R:$U,4,FALSE)),\"\")),\"\")),\"\")","v":""}]
[null,null,null,null,null,null,null,null,null,null,{"$f":"IFERROR(VLOOKUP(K104,'Tiles Remaining'!$A:$C,3,FALSE),\"\")","v":""},{"$f":"IFERROR(VLOOKUP(L104,'Tiles Remaining'!$A:$C,3,FALSE),\"\")","v":""},{"$f":"IFERROR(VLOOKUP(M104,'Tiles Remaining'!$A:$C,3,FALSE),\"\")","v":""},{"$f":"IFERROR(VLOOKUP(N104,'Tiles Remaining'!$A:$C,3,FALSE),\"\")","v":""},{"$f":"IFERROR(VLOOKUP(O104,'Tiles Remaining'!$A:$C,3,FALSE),\"\")","v":""},{"$f":"IFERROR(VLOOKUP(P104,'Tiles Remaining'!$A:$C,3,FALSE),\"\")","v":""},{"$f":"IFERROR(VLOOKUP(Q104,'Tiles Remaining'!$A:$C,3,FALSE),\"\")","v":""},{"$f":"IFERROR(VLOOKUP(R104,'Tiles Remaining'!$A:$C,3,FALSE),\"\")","v":""},{"$f":"IFERROR(VLOOKUP(S104,'Tiles Remaining'!$A:$C,3,FALSE),\"\")","v":""},{"$f":"IFERROR(VLOOKUP(T104,'Tiles Remaining'!$A:$C,3,FALSE),\"\")","v":""},{"$f":"IFERROR(VLOOKUP(U104,'Tiles Remaining'!$A:$C,3,FALSE),\"\")","v":""},{"$f":"IFERROR(VLOOKUP(V104,'Tiles Remaining'!$A:$C,3,FALSE),\"\")","v":""},{"$f":"IFERROR(VLOOKUP(W104,'Tiles Remaining'!$A:$C,3,FALSE),\"\")","v":""},{"$f":"IFERROR(VLOOKUP(X104,'Tiles Remaining'!$A:$C,3,FALSE),\"\")","v":""},{"$f":"IFERROR(VLOOKUP(Y104,'Tiles Remaining'!$A:$C,3,FALSE),\"\")","v":""},{"$f":"SUM(K105:Y105)","v":0}]
[null,null,null,null,null,null,null,null,null,null,null,"Horizontal 3 - Side A"]
[null,null,null,null,null,null,null,null,null,null,null,1,2,3,4,5,6,7,8,9,10,11,12,13,14]
[null,null,null,null,null,null,null,null,null,null,{"$f":"F26","v":""},{"$f":"IF(AND(K108<>\"\",REPLACE(K108,1,1,\"\")<>\"2\",REPLACE(K108,1,1,\"\")<>\"1\"),CONCATENATE(LEFT(K108),VALUE(REPLACE(K108,1,1,\"\"))-1),\"\")","v":""},{"$f":"IF(AND(L108<>\"\",REPLACE(L108,1,1,\"\")<>\"2\",REPLACE(L108,1,1,\"\")<>\"1\"),CONCATENATE(LEFT(L108),VALUE(REPLACE(L108,1,1,\"\"))-1),\"\")","v":""},"","","","","","","","","","","",""]
[null,null,null,null,null,null,null,null,null,null,{"$f":"IF(IFERROR(IF(K108=\"\",\"\",IF(OR($D$9=\"Horizontal\",$D$9=\"Single Letter\"),INDEX('Current Board'!$B$2:$P$16,VLOOKUP(Scorekeeping!K108,'Standard Board Scores'!$R:$U,3,FALSE),VLOOKUP(Scorekeeping!K108,'Standard Board Scores'!$R:$U,4,FALSE)),\"\")),\"\")=0,\"\",IFERROR(IF(ISERROR(K108),\"\",IF(OR($D$9=\"Horizontal\",$D$9=\"Single Letter\"),INDEX('Current Board'!$B$2:$P$16,VLOOKUP(Scorekeeping!K108,'Standard Board Scores'!$R:$U,3,FALSE),VLOOKUP(Scorekeeping!K108,'Standard Board Scores'!$R:$U,4,FALSE)),\"\")),\"\"))","v":""},{"$f":"IF(K109<>\"\",IF(IFERROR(IF(L108=\"\",\"\",IF(OR($D$9=\"Horizontal\",$D$9=\"Single Letter\"),INDEX('Current Board'!$B$2:$P$16,VLOOKUP(Scorekeeping!L108,'Standard Board Scores'!$R:$U,3,FALSE),VLOOKUP(Scorekeeping!L108,'Standard Board Scores'!$R:$U,4,FALSE)),\"\")),\"\")=0,\"\",IFERROR(IF(ISERROR(L108),\"\",IF(OR($D$9=\"Horizontal\",$D$9=\"Single Letter\"),INDEX('Current Board'!$B$2:$P$16,VLOOKUP(Scorekeeping!L108,'Standard Board Scores'!$R:$U,3,FALSE),VLOOKUP(Scorekeeping!L108,'Standard Board Scores'!$R:$U,4,FALSE)),\"\")),\"\")),\"\")","v":""},{"$f":"IF(L109<>\"\",IF(IFERROR(IF(M108=\"\",\"\",IF(OR($D$9=\"Horizontal\",$D$9=\"Single Letter\"),INDEX('Current Board'!$B$2:$P$16,VLOOKUP(Scorekeeping!M108,'Standard Board Scores'!$R:$U,3,FALSE),VLOOKUP(Scorekeeping!M108,'Standard Board Scores'!$R:$U,4,FALSE)),\"\")),\"\")=0,\"\",IFERROR(IF(ISERROR(M108),\"\",IF(OR($D$9=\"Horizontal\",$D$9=\"Single Letter\"),INDEX('Current Board'!$B$2:$P$16,VLOOKUP(Scorekeeping!M108,'Standard Board Scores'!$R:$U,3,FALSE),VLOOKUP(Scorekeeping!M108,'Standard Board Scores'!$R:$U,4,FALSE)),\"\")),\"\")),\"\")","v":""},{"$f":"IF(M109<>\"\",IF(IFERROR(IF(N108=\"\",\"\",IF(OR($D$9=\"Horizontal\",$D$9=\"Single Letter\"),INDEX('Current Board'!$B$2:$P$16,VLOOKUP(Scorekeeping!N108,'Standard Board Scores'!$R:$U,3,FALSE),VLOOKUP(Scorekeeping!N108,'Standard Board Scores'!$R:$U,4,FALSE)),\"\")),\"\")=0,\"\",IFERROR(IF(ISERROR(N108),\"\",IF(OR($D$9=\"Horizontal\",$D$9=\"Single Letter\"),INDEX('Current Board'!$B$2:$P$16,VLOOKUP(Scorekeeping!N108,'Standard Board Scores'!$R:$U,3,FALSE),VLOOKUP(Scorekeeping!N108,'Standard Board Scores'!$R:$U,4,FALSE)),\"\")),\"\")),\"\")","v":""},{"$f":"IF(N109<>\"\",IF(IFERROR(IF(O108=\"\",\"\",IF(OR($D$9=\"Horizontal\",$D$9=\"Single Letter\"),INDEX('Current Board'!$B$2:$P$16,VLOOKUP(Scorekeeping!O108,'Standard Board Scores'!$R:$U,3,FALSE),VLOOKUP(Scorekeeping!O108,'Standard Board Scores'!$R:$U,4,FALSE)),\"\")),\"\")=0,\"\",IFERROR(IF(ISERROR(O108),\"\",IF(OR($D$9=\"Horizontal\",$D$9=\"Single Letter\"),INDEX('Current Board'!$B$2:$P$16,VLOOKUP(Scorekeeping!O108,'Standard Board Scores'!$R:$U,3,FALSE),VLOOKUP(Scorekeeping!O108,'Standard Board Scores'!$R:$U,4,FALSE)),\"\")),\"\")),\"\")","v":""},{"$f":"IF(O109<>\"\",IF(IFERROR(IF(P108=\"\",\"\",IF(OR($D$9=\"Horizontal\",$D$9=\"Single Letter\"),INDEX('Current Board'!$B$2:$P$16,VLOOKUP(Scorekeeping!P108,'Standard Board Scores'!$R:$U,3,FALSE),VLOOKUP(Scorekeeping!P108,'Standard Board Scores'!$R:$U,4,FALSE)),\"\")),\"\")=0,\"\",IFERROR(IF(ISERROR(P108),\"\",IF(OR($D$9=\"Horizontal\",$D$9=\"Single Letter\"),INDEX('Current Board'!$B$2:$P$16,VLOOKUP(Scorekeeping!P108,'Standard Board Scores'!$R:$U,3,FALSE),VLOOKUP(Scorekeeping!P108,'Standard Board Scores'!$R:$U,4,FALSE)),\"\")),\"\")),\"\")","v":""},{"$f":"IF(P109<>\"\",IF(IFERROR(IF(Q108=\"\",\"\",IF(OR($D$9=\"Horizontal\",$D$9=\"Single Letter\"),INDEX('Current Board'!$B$2:$P$16,VLOOKUP(Scorekeeping!Q108,'Standard Board Scores'!$R:$U,3,FALSE),VLOOKUP(Scorekeeping!Q108,'Standard Board Scores'!$R:$U,4,FALSE)),\"\")),\"\")=0,\"\",IFERROR(IF(ISERROR(Q108),\"\",IF(OR($D$9=\"Horizontal\",$D$9=\"Single Letter\"),INDEX('Current Board'!$B$2:$P$16,VLOOKUP(Scorekeeping!Q108,'Standard Board Scores'!$R:$U,3,FALSE),VLOOKUP(Scorekeeping!Q108,'Standard Board Scores'!$R:$U,4,FALSE)),\"\")),\"\")),\"\")","v":""},{"$f":"IF(Q109<>\"\",IF(IFERROR(IF(R108=\"\",\"\",IF(OR($D$9=\"Horizontal\",$D$9=\"Single Letter\"),INDEX('Current Board'!$B$2:$P$16,VLOOKUP(Scorekeeping!R108,'Standard Board Scores'!$R:$U,3,FALSE),VLOOKUP(Scorekeeping!R108,'Standard Board Scores'!$R:$U,4,FALSE)),\"\")),\"\")=0,\"\",IFERROR(IF(ISERROR(R108),\"\",IF(OR($D$9=\"Horizontal\",$D$9=\"Single Letter\"),INDEX('Current Board'!$B$2:$P$16,VLOOKUP(Scorekeeping!R108,'Standard Board Scores'!$R:$U,3,FALSE),VLOOKUP(Scorekeeping!R108,'Standard Board Scores'!$R:$U,4,FALSE)),\"\")),\"\")),\"\")","v":""},{"$f":"IF(R109<>\"\",IF(IFERROR(IF(S108=\"\",\"\",IF(OR($D$9=\"Horizontal\",$D$9=\"Single Letter\"),INDEX('Current Board'!$B$2:$P$16,VLOOKUP(Scorekeeping!S108,'Standard Board Scores'!$R:$U,3,FALSE),VLOOKUP(Scorekeeping!S108,'Standard Board Scores'!$R:$U,4,FALSE)),\"\")),\"\")=0,\"\",IFERROR(IF(ISERROR(S108),\"\",IF(OR($D$9=\"Horizontal\",$D$9=\"Single Letter\"),INDEX('Current Board'!$B$2:$P$16,VLOOKUP(Scorekeeping!S108,'Standard Board Scores'!$R:$U,3,FALSE),VLOOKUP(Scorekeeping!S108,'Standard Board Scores'!$R:$U,4,FALSE)),\"\")),\"\")),\"\")","v":""},{"$f":"IF(S109<>\"\",IF(IFERROR(IF(T108=\"\",\"\",IF(OR($D$9=\"Horizontal\",$D$9=\"Single Letter\"),INDEX('Current Board'!$B$2:$P$16,VLOOKUP(Scorekeeping!T108,'Standard Board Scores'!$R:$U,3,FALSE),VLOOKUP(Scorekeeping!T108,'Standard Board Scores'!$R:$U,4,FALSE)),\"\")),\"\")=0,\"\",IFERROR(IF(ISERROR(T108),\"\",IF(OR($D$9=\"Horizontal\",$D$9=\"Single Letter\"),INDEX('Current Board'!$B$2:$P$16,VLOOKUP(Scorekeeping!T108,'Standard Board Scores'!$R:$U,3,FALSE),VLOOKUP(Scorekeeping!T108,'Standard Board Scores'!$R:$U,4,FALSE)),\"\")),\"\")),\"\")","v":""},{"$f":"IF(T109<>\"\",IF(IFERROR(IF(U108=\"\",\"\",IF(OR($D$9=\"Horizontal\",$D$9=\"Single Letter\"),INDEX('Current Board'!$B$2:$P$16,VLOOKUP(Scorekeeping!U108,'Standard Board Scores'!$R:$U,3,FALSE),VLOOKUP(Scorekeeping!U108,'Standard Board Scores'!$R:$U,4,FALSE)),\"\")),\"\")=0,\"\",IFERROR(IF(ISERROR(U108),\"\",IF(OR($D$9=\"Horizontal\",$D$9=\"Single Letter\"),INDEX('Current Board'!$B$2:$P$16,VLOOKUP(Scorekeeping!U108,'Standard Board Scores'!$R:$U,3,FALSE),VLOOKUP(Scorekeeping!U108,'Standard Board Scores'!$R:$U,4,FALSE)),\"\")),\"\")),\"\")","v":""},{"$f":"IF(U109<>\"\",IF(IFERROR(IF(V108=\"\",\"\",IF(OR($D$9=\"Horizontal\",$D$9=\"Single Letter\"),INDEX('Current Board'!$B$2:$P$16,VLOOKUP(Scorekeeping!V108,'Standard Board Scores'!$R:$U,3,FALSE),VLOOKUP(Scorekeeping!V108,'Standard Board Scores'!$R:$U,4,FALSE)),\"\")),\"\")=0,\"\",IFERROR(IF(ISERROR(V108),\"\",IF(OR($D$9=\"Horizontal\",$D$9=\"Single Letter\"),INDEX('Current Board'!$B$2:$P$16,VLOOKUP(Scorekeeping!V108,'Standard Board Scores'!$R:$U,3,FALSE),VLOOKUP(Scorekeeping!V108,'Standard Board Scores'!$R:$U,4,FALSE)),\"\")),\"\")),\"\")","v":""},{"$f":"IF(V109<>\"\",IF(IFERROR(IF(W108=\"\",\"\",IF(OR($D$9=\"Horizontal\",$D$9=\"Single Letter\"),INDEX('Current Board'!$B$2:$P$16,VLOOKUP(Scorekeeping!W108,'Standard Board Scores'!$R:$U,3,FALSE),VLOOKUP(Scorekeeping!W108,'Standard Board Scores'!$R:$U,4,FALSE)),\"\")),\"\")=0,\"\",IFERROR(IF(ISERROR(W108),\"\",IF(OR($D$9=\"Horizontal\",$D$9=\"Single Letter\"),INDEX('Current Board'!$B$2:$P$16,VLOOKUP(Scorekeeping!W108,'Standard Board Scores'!$R:$U,3,FALSE),VLOOKUP(Scorekeeping!W108,'Standard Board Scores'!$R:$U,4,FALSE)),\"\")),\"\")),\"\")","v":""},{"$f":"IF(W109<>\"\",IF(IFERROR(IF(X108=\"\",\"\",IF(OR($D$9=\"Horizontal\",$D$9=\"Single Letter\"),INDEX('Current Board'!$B$2:$P$16,VLOOKUP(Scorekeeping!X108,'Standard Board Scores'!$R:$U,3,FALSE),VLOOKUP(Scorekeeping!X108,'Standard Board Scores'!$R:$U,4,FALSE)),\"\")),\"\")=0,\"\",IFERROR(IF(ISERROR(X108),\"\",IF(OR($D$9=\"Horizontal\",$D$9=\"Single Letter\"),INDEX('Current Board'!$B$2:$P$16,VLOOKUP(Scorekeeping!X108,'Standard Board Scores'!$R:$U,3,FALSE),VLOOKUP(Scorekeeping!X108,'Standard Board Scores'!$R:$U,4,FALSE)),\"\")),\"\")),\"\")","v":""},{"$f":"IF(X109<>\"\",IF(IFERROR(IF(Y108=\"\",\"\",IF(OR($D$9=\"Horizontal\",$D$9=\"Single Letter\"),INDEX('Current Board'!$B$2:$P$16,VLOOKUP(Scorekeeping!Y108,'Standard Board Scores'!$R:$U,3,FALSE),VLOOKUP(Scorekeeping!Y108,'Standard Board Scores'!$R:$U,4,FALSE)),\"\")),\"\")=0,\"\",IFERROR(IF(ISERROR(Y108),\"\",IF(OR($D$9=\"Horizontal\",$D$9=\"Single Letter\"),INDEX('Current Board'!$B$2:$P$16,VLOOKUP(Scorekeeping!Y108,'Standard Board Scores'!$R:$U,3,FALSE),VLOOKUP(Scorekeeping!Y108,'Standard Board Scores'!$R:$U,4,FALSE)),\"\")),\"\")),\"\")","v":""}]
[null,null,null,null,null,null,null,null,null,null,{"$f":"IFERROR(VLOOKUP(K109,'Tiles Remaining'!$A:$C,3,FALSE),\"\")","v":""},{"$f":"IFERROR(VLOOKUP(L109,'Tiles Remaining'!$A:$C,3,FALSE),\"\")","v":""},{"$f":"IFERROR(VLOOKUP(M109,'Tiles Remaining'!$A:$C,3,FALSE),\"\")","v":""},{"$f":"IFERROR(VLOOKUP(N109,'Tiles Remaining'!$A:$C,3,FALSE),\"\")","v":""},{"$f":"IFERROR(VLOOKUP(O109,'Tiles Remaining'!$A:$C,3,FALSE),\"\")","v":""},{"$f":"IFERROR(VLOOKUP(P109,'Tiles Remaining'!$A:$C,3,FALSE),\"\")","v":""},{"$f":"IFERROR(VLOOKUP(Q109,'Tiles Remaining'!$A:$C,3,FALSE),\"\")","v":""},{"$f":"IFERROR(VLOOKUP(R109,'Tiles Remaining'!$A:$C,3,FALSE),\"\")","v":""},{"$f":"IFERROR(VLOOKUP(S109,'Tiles Remaining'!$A:$C,3,FALSE),\"\")","v":""},{"$f":"IFERROR(VLOOKUP(T109,'Tiles Remaining'!$A:$C,3,FALSE),\"\")","v":""},{"$f":"IFERROR(VLOOKUP(U109,'Tiles Remaining'!$A:$C,3,FALSE),\"\")","v":""},{"$f":"IFERROR(VLOOKUP(V109,'Tiles Remaining'!$A:$C,3,FALSE),\"\")","v":""},{"$f":"IFERROR(VLOOKUP(W109,'Tiles Remaining'!$A:$C,3,FALSE),\"\")","v":""},{"$f":"IFERROR(VLOOKUP(X109,'Tiles Remaining'!$A:$C,3,FALSE),\"\")","v":""},{"$f":"IFERROR(VLOOKUP(Y109,'Tiles Remaining'!$A:$C,3,FALSE),\"\")","v":""},{"$f":"SUM(K110:Y110)","v":0}]
[null,null,null,null,null,null,null,null,null,null,null,"Horizontal 4 - Side A"]
[null,null,null,null,null,null,null,null,null,null,null,1,2,3,4,5,6,7,8,9,10,11,12,13,14]
[null,null,null,null,null,null,null,null,null,null,{"$f":"G26","v":""},{"$f":"IF(AND(K113<>\"\",REPLACE(K113,1,1,\"\")<>\"2\",REPLACE(K113,1,1,\"\")<>\"1\"),CONCATENATE(LEFT(K113),VALUE(REPLACE(K113,1,1,\"\"))-1),\"\")","v":""},{"$f":"IF(AND(L113<>\"\",REPLACE(L113,1,1,\"\")<>\"2\",REPLACE(L113,1,1,\"\")<>\"1\"),CONCATENATE(LEFT(L113),VALUE(REPLACE(L113,1,1,\"\"))-1),\"\")","v":""},"","","","","","","","","","","",""]
[null,null,null,null,null,null,null,null,null,null,{"$f":"IF(IFERROR(IF(K113=\"\",\"\",IF(OR($D$9=\"Horizontal\",$D$9=\"Single Letter\"),INDEX('Current Board'!$B$2:$P$16,VLOOKUP(Scorekeeping!K113,'Standard Board Scores'!$R:$U,3,FALSE),VLOOKUP(Scorekeeping!K113,'Standard Board Scores'!$R:$U,4,FALSE)),\"\")),\"\")=0,\"\",IFERROR(IF(ISERROR(K113),\"\",IF(OR($D$9=\"Horizontal\",$D$9=\"Single Letter\"),INDEX('Current Board'!$B$2:$P$16,VLOOKUP(Scorekeeping!K113,'Standard Board Scores'!$R:$U,3,FALSE),VLOOKUP(Scorekeeping!K113,'Standard Board Scores'!$R:$U,4,FALSE)),\"\")),\"\"))","v":""},{"$f":"IF(K114<>\"\",IF(IFERROR(IF(L113=\"\",\"\",IF(OR($D$9=\"Horizontal\",$D$9=\"Single Letter\"),INDEX('Current Board'!$B$2:$P$16,VLOOKUP(Scorekeeping!L113,'Standard Board Scores'!$R:$U,3,FALSE),VLOOKUP(Scorekeeping!L113,'Standard Board Scores'!$R:$U,4,FALSE)),\"\")),\"\")=0,\"\",IFERROR(IF(ISERROR(L113),\"\",IF(OR($D$9=\"Horizontal\",$D$9=\"Single Letter\"),INDEX('Current Board'!$B$2:$P$16,VLOOKUP(Scorekeeping!L113,'Standard Board Scores'!$R:$U,3,FALSE),VLOOKUP(Scorekeeping!L113,'Standard Board Scores'!$R:$U,4,FALSE)),\"\")),\"\")),\"\")","v":""},{"$f":"IF(L114<>\"\",IF(IFERROR(IF(M113=\"\",\"\",IF(OR($D$9=\"Horizontal\",$D$9=\"Single Letter\"),INDEX('Current Board'!$B$2:$P$16,VLOOKUP(Scorekeeping!M113,'Standard Board Scores'!$R:$U,3,FALSE),VLOOKUP(Scorekeeping!M113,'Standard Board Scores'!$R:$U,4,FALSE)),\"\")),\"\")=0,\"\",IFERROR(IF(ISERROR(M113),\"\",IF(OR($D$9=\"Horizontal\",$D$9=\"Single Letter\"),INDEX('Current Board'!$B$2:$P$16,VLOOKUP(Scorekeeping!M113,'Standard Board Scores'!$R:$U,3,FALSE),VLOOKUP(Scorekeeping!M113,'Standard Board Scores'!$R:$U,4,FALSE)),\"\")),\"\")),\"\")","v":""},{"$f":"IF(M114<>\"\",IF(IFERROR(IF(N113=\"\",\"\",IF(OR($D$9=\"Horizontal\",$D$9=\"Single Letter\"),INDEX('Current Board'!$B$2:$P$16,VLOOKUP(Scorekeeping!N113,'Standard Board Scores'!$R:$U,3,FALSE),VLOOKUP(Scorekeeping!N113,'Standard Board Scores'!$R:$U,4,FALSE)),\"\")),\"\")=0,\"\",IFERROR(IF(ISERROR(N113),\"\",IF(OR($D$9=\"Horizontal\",$D$9=\"Single Letter\"),INDEX('Current Board'!$B$2:$P$16,VLOOKUP(Scorekeeping!N113,'Standard Board Scores'!$R:$U,3,FALSE),VLOOKUP(Scorekeeping!N113,'Standard Board Scores'!$R:$U,4,FALSE)),\"\")),\"\")),\"\")","v":""},{"$f":"IF(N114<>\"\",IF(IFERROR(IF(O113=\"\",\"\",IF(OR($D$9=\"Horizontal\",$D$9=\"Single Letter\"),INDEX('Current Board'!$B$2:$P$16,VLOOKUP(Scorekeeping!O113,'Standard Board Scores'!$R:$U,3,FALSE),VLOOKUP(Scorekeeping!O113,'Standard Board Scores'!$R:$U,4,FALSE)),\"\")),\"\")=0,\"\",IFERROR(IF(ISERROR(O113),\"\",IF(OR($D$9=\"Horizontal\",$D$9=\"Single Letter\"),INDEX('Current Board'!$B$2:$P$16,VLOOKUP(Scorekeeping!O113,'Standard Board Scores'!$R:$U,3,FALSE),VLOOKUP(Scorekeeping!O113,'Standard Board Scores'!$R:$U,4,FALSE)),\"\")),\"\")),\"\")","v":""},{"$f":"IF(O114<>\"\",IF(IFERROR(IF(P113=\"\",\"\",IF(OR($D$9=\"Horizontal\",$D$9=\"Single Letter\"),INDEX('Current Board'!$B$2:$P$16,VLOOKUP(Scorekeeping!P113,'Standard Board Scores'!$R:$U,3,FALSE),VLOOKUP(Scorekeeping!P113,'Standard Board Scores'!$R:$U,4,FALSE)),\"\")),\"\")=0,\"\",IFERROR(IF(ISERROR(P113),\"\",IF(OR($D$9=\"Horizontal\",$D$9=\"Single Letter\"),INDEX('Current Board'!$B$2:$P$16,VLOOKUP(Scorekeeping!P113,'Standard Board Scores'!$R:$U,3,FALSE),VLOOKUP(Scorekeeping!P113,'Standard Board Scores'!$R:$U,4,FALSE)),\"\")),\"\")),\"\")","v":""},{"$f":"IF(P114<>\"\",IF(IFERROR(IF(Q113=\"\",\"\",IF(OR($D$9=\"Horizontal\",$D$9=\"Single Letter\"),INDEX('Current Board'!$B$2:$P$16,VLOOKUP(Scorekeeping!Q113,'Standard Board Scores'!$R:$U,3,FALSE),VLOOKUP(Scorekeeping!Q113,'Standard Board Scores'!$R:$U,4,FALSE)),\"\")),\"\")=0,\"\",IFERROR(IF(ISERROR(Q113),\"\",IF(OR($D$9=\"Horizontal\",$D$9=\"Single Letter\"),INDEX('Current Board'!$B$2:$P$16,VLOOKUP(Scorekeeping!Q113,'Standard Board Scores'!$R:$U,3,FALSE),VLOOKUP(Scorekeeping!Q113,'Standard Board Scores'!$R:$U,4,FALSE)),\"\")),\"\")),\"\")","v":""},{"$f":"IF(Q114<>\"\",IF(IFERROR(IF(R113=\"\",\"\",IF(OR($D$9=\"Horizontal\",$D$9=\"Single Letter\"),INDEX('Current Board'!$B$2:$P$16,VLOOKUP(Scorekeeping!R113,'Standard Board Scores'!$R:$U,3,FALSE),VLOOKUP(Scorekeeping!R113,'Standard Board Scores'!$R:$U,4,FALSE)),\"\")),\"\")=0,\"\",IFERROR(IF(ISERROR(R113),\"\",IF(OR($D$9=\"Horizontal\",$D$9=\"Single Letter\"),INDEX('Current Board'!$B$2:$P$16,VLOOKUP(Scorekeeping!R113,'Standard Board Scores'!$R:$U,3,FALSE),VLOOKUP(Scorekeeping!R113,'Standard Board Scores'!$R:$U,4,FALSE)),\"\")),\"\")),\"\")","v":""},{"$f":"IF(R114<>\"\",IF(IFERROR(IF(S113=\"\",\"\",IF(OR($D$9=\"Horizontal\",$D$9=\"Single Letter\"),INDEX('Current Board'!$B$2:$P$16,VLOOKUP(Scorekeeping!S113,'Standard Board Scores'!$R:$U,3,FALSE),VLOOKUP(Scorekeeping!S113,'Standard Board Scores'!$R:$U,4,FALSE)),\"\")),\"\")=0,\"\",IFERROR(IF(ISERROR(S113),\"\",IF(OR($D$9=\"Horizontal\",$D$9=\"Single Letter\"),INDEX('Current Board'!$B$2:$P$16,VLOOKUP(Scorekeeping!S113,'Standard Board Scores'!$R:$U,3,FALSE),VLOOKUP(Scorekeeping!S113,'Standard Board Scores'!$R:$U,4,FALSE)),\"\")),\"\")),\"\")","v":""},{"$f":"IF(S114<>\"\",IF(IFERROR(IF(T113=\"\",\"\",IF(OR($D$9=\"Horizontal\",$D$9=\"Single Letter\"),INDEX('Current Board'!$B$2:$P$16,VLOOKUP(Scorekeeping!T113,'Standard Board Scores'!$R:$U,3,FALSE),VLOOKUP(Scorekeeping!T113,'Standard Board Scores'!$R:$U,4,FALSE)),\"\")),\"\")=0,\"\",IFERROR(IF(ISERROR(T113),\"\",IF(OR($D$9=\"Horizontal\",$D$9=\"Single Letter\"),INDEX('Current Board'!$B$2:$P$16,VLOOKUP(Scorekeeping!T113,'Standard Board Scores'!$R:$U,3,FALSE),VLOOKUP(Scorekeeping!T113,'Standard Board Scores'!$R:$U,4,FALSE)),\"\")),\"\")),\"\")","v":""},{"$f":"IF(T114<>\"\",IF(IFERROR(IF(U113=\"\",\"\",IF(OR($D$9=\"Horizontal\",$D$9=\"Single Letter\"),INDEX('Current Board'!$B$2:$P$16,VLOOKUP(Scorekeeping!U113,'Standard Board Scores'!$R:$U,3,FALSE),VLOOKUP(Scorekeeping!U113,'Standard Board Scores'!$R:$U,4,FALSE)),\"\")),\"\")=0,\"\",IFERROR(IF(ISERROR(U113),\"\",IF(OR($D$9=\"Horizontal\",$D$9=\"Single Letter\"),INDEX('Current Board'!$B$2:$P$16,VLOOKUP(Scorekeeping!U113,'Standard Board Scores'!$R:$U,3,FALSE),VLOOKUP(Scorekeeping!U113,'Standard Board Scores'!$R:$U,4,FALSE)),\"\")),\"\")),\"\")","v":""},{"$f":"IF(U114<>\"\",IF(IFERROR(IF(V113=\"\",\"\",IF(OR($D$9=\"Horizontal\",$D$9=\"Single Letter\"),INDEX('Current Board'!$B$2:$P$16,VLOOKUP(Scorekeeping!V113,'Standard Board Scores'!$R:$U,3,FALSE),VLOOKUP(Scorekeeping!V113,'Standard Board Scores'!$R:$U,4,FALSE)),\"\")),\"\")=0,\"\",IFERROR(IF(ISERROR(V113),\"\",IF(OR($D$9=\"Horizontal\",$D$9=\"Single Letter\"),INDEX('Current Board'!$B$2:$P$16,VLOOKUP(Scorekeeping!V113,'Standard Board Scores'!$R:$U,3,FALSE),VLOOKUP(Scorekeeping!V113,'Standard Board Scores'!$R:$U,4,FALSE)),\"\")),\"\")),\"\")","v":""},{"$f":"IF(V114<>\"\",IF(IFERROR(IF(W113=\"\",\"\",IF(OR($D$9=\"Horizontal\",$D$9=\"Single Letter\"),INDEX('Current Board'!$B$2:$P$16,VLOOKUP(Scorekeeping!W113,'Standard Board Scores'!$R:$U,3,FALSE),VLOOKUP(Scorekeeping!W113,'Standard Board Scores'!$R:$U,4,FALSE)),\"\")),\"\")=0,\"\",IFERROR(IF(ISERROR(W113),\"\",IF(OR($D$9=\"Horizontal\",$D$9=\"Single Letter\"),INDEX('Current Board'!$B$2:$P$16,VLOOKUP(Scorekeeping!W113,'Standard Board Scores'!$R:$U,3,FALSE),VLOOKUP(Scorekeeping!W113,'Standard Board Scores'!$R:$U,4,FALSE)),\"\")),\"\")),\"\")","v":""},{"$f":"IF(W114<>\"\",IF(IFERROR(IF(X113=\"\",\"\",IF(OR($D$9=\"Horizontal\",$D$9=\"Single Letter\"),INDEX('Current Board'!$B$2:$P$16,VLOOKUP(Scorekeeping!X113,'Standard Board Scores'!$R:$U,3,FALSE),VLOOKUP(Scorekeeping!X113,'Standard Board Scores'!$R:$U,4,FALSE)),\"\")),\"\")=0,\"\",IFERROR(IF(ISERROR(X113),\"\",IF(OR($D$9=\"Horizontal\",$D$9=\"Single Letter\"),INDEX('Current Board'!$B$2:$P$16,VLOOKUP(Scorekeeping!X113,'Standard Board Scores'!$R:$U,3,FALSE),VLOOKUP(Scorekeeping!X113,'Standard Board Scores'!$R:$U,4,FALSE)),\"\")),\"\")),\"\")","v":""},{"$f":"IF(X114<>\"\",IF(IFERROR(IF(Y113=\"\",\"\",IF(OR($D$9=\"Horizontal\",$D$9=\"Single Letter\"),INDEX('Current Board'!$B$2:$P$16,VLOOKUP(Scorekeeping!Y113,'Standard Board Scores'!$R:$U,3,FALSE),VLOOKUP(Scorekeeping!Y113,'Standard Board Scores'!$R:$U,4,FALSE)),\"\")),\"\")=0,\"\",IFERROR(IF(ISERROR(Y113),\"\",IF(OR($D$9=\"Horizontal\",$D$9=\"Single Letter\"),INDEX('Current Board'!$B$2:$P$16,VLOOKUP(Scorekeeping!Y113,'Standard Board Scores'!$R:$U,3,FALSE),VLOOKUP(Scorekeeping!Y113,'Standard Board Scores'!$R:$U,4,FALSE)),\"\")),\"\")),\"\")","v":""}]
[null,null,null,null,null,null,null,null,null,null,{"$f":"IFERROR(VLOOKUP(K114,'Tiles Remaining'!$A:$C,3,FALSE),\"\")","v":""},{"$f":"IFERROR(VLOOKUP(L114,'Tiles Remaining'!$A:$C,3,FALSE),\"\")","v":""},{"$f":"IFERROR(VLOOKUP(M114,'Tiles Remaining'!$A:$C,3,FALSE),\"\")","v":""},{"$f":"IFERROR(VLOOKUP(N114,'Tiles Remaining'!$A:$C,3,FALSE),\"\")","v":""},{"$f":"IFERROR(VLOOKUP(O114,'Tiles Remaining'!$A:$C,3,FALSE),\"\")","v":""},{"$f":"IFERROR(VLOOKUP(P114,'Tiles Remaining'!$A:$C,3,FALSE),\"\")","v":""},{"$f":"IFERROR(VLOOKUP(Q114,'Tiles Remaining'!$A:$C,3,FALSE),\"\")","v":""},{"$f":"IFERROR(VLOOKUP(R114,'Tiles Remaining'!$A:$C,3,FALSE),\"\")","v":""},{"$f":"IFERROR(VLOOKUP(S114,'Tiles Remaining'!$A:$C,3,FALSE),\"\")","v":""},{"$f":"IFERROR(VLOOKUP(T114,'Tiles Remaining'!$A:$C,3,FALSE),\"\")","v":""},{"$f":"IFERROR(VLOOKUP(U114,'Tiles Remaining'!$A:$C,3,FALSE),\"\")","v":""},{"$f":"IFERROR(VLOOKUP(V114,'Tiles Remaining'!$A:$C,3,FALSE),\"\")","v":""},{"$f":"IFERROR(VLOOKUP(W114,'Tiles Remaining'!$A:$C,3,FALSE),\"\")","v":""},{"$f":"IFERROR(VLOOKUP(X114,'Tiles Remaining'!$A:$C,3,FALSE),\"\")","v":""},{"$f":"IFERROR(VLOOKUP(Y114,'Tiles Remaining'!$A:$C,3,FALSE),\"\")","v":""},{"$f":"SUM(K115:Y115)","v":0}]
[null,null,null,null,null,null,null,null,null,null,null,"Horizontal 5 - Side A"]
[null,null,null,null,null,null,null,null,null,null,null,1,2,3,4,5,6,7,8,9,10,11,12,13,14]
[null,null,null,null,null,null,null,null,null,null,{"$f":"H26","v":""},{"$f":"IF(AND(K118<>\"\",REPLACE(K118,1,1,\"\")<>\"2\",REPLACE(K118,1,1,\"\")<>\"1\"),CONCATENATE(LEFT(K118),VALUE(REPLACE(K118,1,1,\"\"))-1),\"\")","v":""},{"$f":"IF(AND(L118<>\"\",REPLACE(L118,1,1,\"\")<>\"2\",REPLACE(L118,1,1,\"\")<>\"1\"),CONCATENATE(LEFT(L118),VALUE(REPLACE(L118,1,1,\"\"))-1),\"\")","v":""},"","","","","","","","","","","",""]
[null,null,null,null,null,null,null,null,null,null,{"$f":"IF(IFERROR(IF(K118=\"\",\"\",IF(OR($D$9=\"Horizontal\",$D$9=\"Single Letter\"),INDEX('Current Board'!$B$2:$P$16,VLOOKUP(Scorekeeping!K118,'Standard Board Scores'!$R:$U,3,FALSE),VLOOKUP(Scorekeeping!K118,'Standard Board Scores'!$R:$U,4,FALSE)),\"\")),\"\")=0,\"\",IFERROR(IF(ISERROR(K118),\"\",IF(OR($D$9=\"Horizontal\",$D$9=\"Single Letter\"),INDEX('Current Board'!$B$2:$P$16,VLOOKUP(Scorekeeping!K118,'Standard Board Scores'!$R:$U,3,FALSE),VLOOKUP(Scorekeeping!K118,'Standard Board Scores'!$R:$U,4,FALSE)),\"\")),\"\"))","v":""},{"$f":"IF(K119<>\"\",IF(IFERROR(IF(L118=\"\",\"\",IF(OR($D$9=\"Horizontal\",$D$9=\"Single Letter\"),INDEX('Current Board'!$B$2:$P$16,VLOOKUP(Scorekeeping!L118,'Standard Board Scores'!$R:$U,3,FALSE),VLOOKUP(Scorekeeping!L118,'Standard Board Scores'!$R:$U,4,FALSE)),\"\")),\"\")=0,\"\",IFERROR(IF(ISERROR(L118),\"\",IF(OR($D$9=\"Horizontal\",$D$9=\"Single Letter\"),INDEX('Current Board'!$B$2:$P$16,VLOOKUP(Scorekeeping!L118,'Standard Board Scores'!$R:$U,3,FALSE),VLOOKUP(Scorekeeping!L118,'Standard Board Scores'!$R:$U,4,FALSE)),\"\")),\"\")),\"\")","v":""},{"$f":"IF(L119<>\"\",IF(IFERROR(IF(M118=\"\",\"\",IF(OR($D$9=\"Horizontal\",$D$9=\"Single Letter\"),INDEX('Current Board'!$B$2:$P$16,VLOOKUP(Scorekeeping!M118,'Standard Board Scores'!$R:$U,3,FALSE),VLOOKUP(Scorekeeping!M118,'Standard Board Scores'!$R:$U,4,FALSE)),\"\")),\"\")=0,\"\",IFERROR(IF(ISERROR(M118),\"\",IF(OR($D$9=\"Horizontal\",$D$9=\"Single Letter\"),INDEX('Current Board'!$B$2:$P$16,VLOOKUP(Scorekeeping!M118,'Standard Board Scores'!$R:$U,3,FALSE),VLOOKUP(Scorekeeping!M118,'Standard Board Scores'!$R:$U,4,FALSE)),\"\")),\"\")),\"\")","v":""},{"$f":"IF(M119<>\"\",IF(IFERROR(IF(N118=\"\",\"\",IF(OR($D$9=\"Horizontal\",$D$9=\"Single Letter\"),INDEX('Current Board'!$B$2:$P$16,VLOOKUP(Scorekeeping!N118,'Standard Board Scores'!$R:$U,3,FALSE),VLOOKUP(Scorekeeping!N118,'Standard Board Scores'!$R:$U,4,FALSE)),\"\")),\"\")=0,\"\",IFERROR(IF(ISERROR(N118),\"\",IF(OR($D$9=\"Horizontal\",$D$9=\"Single Letter\"),INDEX('Current Board'!$B$2:$P$16,VLOOKUP(Scorekeeping!N118,'Standard Board Scores'!$R:$U,3,FALSE),VLOOKUP(Scorekeeping!N118,'Standard Board Scores'!$R:$U,4,FALSE)),\"\")),\"\")),\"\")","v":""},{"$f":"IF(N119<>\"\",IF(IFERROR(IF(O118=\"\",\"\",IF(OR($D$9=\"Horizontal\",$D$9=\"Single Letter\"),INDEX('Current Board'!$B$2:$P$16,VLOOKUP(Scorekeeping!O118,'Standard Board Scores'!$R:$U,3,FALSE),VLOOKUP(Scorekeeping!O118,'Standard Board Scores'!$R:$U,4,FALSE)),\"\")),\"\")=0,\"\",IFERROR(IF(ISERROR(O118),\"\",IF(OR($D$9=\"Horizontal\",$D$9=\"Single Letter\"),INDEX('Current Board'!$B$2:$P$16,VLOOKUP(Scorekeeping!O118,'Standard Board Scores'!$R:$U,3,FALSE),VLOOKUP(Scorekeeping!O118,'Standard Board Scores'!$R:$U,4,FALSE)),\"\")),\"\")),\"\")","v":""},{"$f":"IF(O119<>\"\",IF(IFERROR(IF(P118=\"\",\"\",IF(OR($D$9=\"Horizontal\",$D$9=\"Single Letter\"),INDEX('Current Board'!$B$2:$P$16,VLOOKUP(Scorekeeping!P118,'Standard Board Scores'!$R:$U,3,FALSE),VLOOKUP(Scorekeeping!P118,'Standard Board Scores'!$R:$U,4,FALSE)),\"\")),\"\")=0,\"\",IFERROR(IF(ISERROR(P118),\"\",IF(OR($D$9=\"Horizontal\",$D$9=\"Single Letter\"),INDEX('Current Board'!$B$2:$P$16,VLOOKUP(Scorekeeping!P118,'Standard Board Scores'!$R:$U,3,FALSE),VLOOKUP(Scorekeeping!P118,'Standard Board Scores'!$R:$U,4,FALSE)),\"\")),\"\")),\"\")","v":""},{"$f":"IF(P119<>\"\",IF(IFERROR(IF(Q118=\"\",\"\",IF(OR($D$9=\"Horizontal\",$D$9=\"Single Letter\"),INDEX('Current Board'!$B$2:$P$16,VLOOKUP(Scorekeeping!Q118,'Standard Board Scores'!$R:$U,3,FALSE),VLOOKUP(Scorekeeping!Q118,'Standard Board Scores'!$R:$U,4,FALSE)),\"\")),\"\")=0,\"\",IFERROR(IF(ISERROR(Q118),\"\",IF(OR($D$9=\"Horizontal\",$D$9=\"Single Letter\"),INDEX('Current Board'!$B$2:$P$16,VLOOKUP(Scorekeeping!Q118,'Standard Board Scores'!$R:$U,3,FALSE),VLOOKUP(Scorekeeping!Q118,'Standard Board Scores'!$R:$U,4,FALSE)),\"\")),\"\")),\"\")","v":""},{"$f":"IF(Q119<>\"\",IF(IFERROR(IF(R118=\"\",\"\",IF(OR($D$9=\"Horizontal\",$D$9=\"Single Letter\"),INDEX('Current Board'!$B$2:$P$16,VLOOKUP(Scorekeeping!R118,'Standard Board Scores'!$R:$U,3,FALSE),VLOOKUP(Scorekeeping!R118,'Standard Board Scores'!$R:$U,4,FALSE)),\"\")),\"\")=0,\"\",IFERROR(IF(ISERROR(R118),\"\",IF(OR($D$9=\"Horizontal\",$D$9=\"Single Letter\"),INDEX('Current Board'!$B$2:$P$16,VLOOKUP(Scorekeeping!R118,'Standard Board Scores'!$R:$U,3,FALSE),VLOOKUP(Scorekeeping!R118,'Standard Board Scores'!$R:$U,4,FALSE)),\"\")),\"\")),\"\")","v":""},{"$f":"IF(R119<>\"\",IF(IFERROR(IF(S118=\"\",\"\",IF(OR($D$9=\"Horizontal\",$D$9=\"Single Letter\"),INDEX('Current Board'!$B$2:$P$16,VLOOKUP(Scorekeeping!S118,'Standard Board Scores'!$R:$U,3,FALSE),VLOOKUP(Scorekeeping!S118,'Standard Board Scores'!$R:$U,4,FALSE)),\"\")),\"\")=0,\"\",IFERROR(IF(ISERROR(S118),\"\",IF(OR($D$9=\"Horizontal\",$D$9=\"Single Letter\"),INDEX('Current Board'!$B$2:$P$16,VLOOKUP(Scorekeeping!S118,'Standard Board Scores'!$R:$U,3,FALSE),VLOOKUP(Scorekeeping!S118,'Standard Board Scores'!$R:$U,4,FALSE)),\"\")),\"\")),\"\")","v":""},{"$f":"IF(S119<>\"\",IF(IFERROR(IF(T118=\"\",\"\",IF(OR($D$9=\"Horizontal\",$D$9=\"Single Letter\"),INDEX('Current Board'!$B$2:$P$16,VLOOKUP(Scorekeeping!T118,'Standard Board Scores'!$R:$U,3,FALSE),VLOOKUP(Scorekeeping!T118,'Standard Board Scores'!$R:$U,4,FALSE)),\"\")),\"\")=0,\"\",IFERROR(IF(ISERROR(T118),\"\",IF(OR($D$9=\"Horizontal\",$D$9=\"Single Letter\"),INDEX('Current Board'!$B$2:$P$16,VLOOKUP(Scorekeeping!T118,'Standard Board Scores'!$R:$U,3,FALSE),VLOOKUP(Scorekeeping!T118,'Standard Board Scores'!$R:$U,4,FALSE)),\"\")),\"\")),\"\")","v":""},{"$f":"IF(T119<>\"\",IF(IFERROR(IF(U118=\"\",\"\",IF(OR($D$9=\"Horizontal\",$D$9=\"Single Letter\"),INDEX('Current Board'!$B$2:$P$16,VLOOKUP(Scorekeeping!U118,'Standard Board Scores'!$R:$U,3,FALSE),VLOOKUP(Scorekeeping!U118,'Standard Board Scores'!$R:$U,4,FALSE)),\"\")),\"\")=0,\"\",IFERROR(IF(ISERROR(U118),\"\",IF(OR($D$9=\"Horizontal\",$D$9=\"Single Letter\"),INDEX('Current Board'!$B$2:$P$16,VLOOKUP(Scorekeeping!U118,'Standard Board Scores'!$R:$U,3,FALSE),VLOOKUP(Scorekeeping!U118,'Standard Board Scores'!$R:$U,4,FALSE)),\"\")),\"\")),\"\")","v":""},{"$f":"IF(U119<>\"\",IF(IFERROR(IF(V118=\"\",\"\",IF(OR($D$9=\"Horizontal\",$D$9=\"Single Letter\"),INDEX('Current Board'!$B$2:$P$16,VLOOKUP(Scorekeeping!V118,'Standard Board Scores'!$R:$U,3,FALSE),VLOOKUP(Scorekeeping!V118,'Standard Board Scores'!$R:$U,4,FALSE)),\"\")),\"\")=0,\"\",IFERROR(IF(ISERROR(V118),\"\",IF(OR($D$9=\"Horizontal\",$D$9=\"Single Letter\"),INDEX('Current Board'!$B$2:$P$16,VLOOKUP(Scorekeeping!V118,'Standard Board Scores'!$R:$U,3,FALSE),VLOOKUP(Scorekeeping!V118,'Standard Board Scores'!$R:$U,4,FALSE)),\"\")),\"\")),\"\")","v":""},{"$f":"IF(V119<>\"\",IF(IFERROR(IF(W118=\"\",\"\",IF(OR($D$9=\"Horizontal\",$D$9=\"Single Letter\"),INDEX('Current Board'!$B$2:$P$16,VLOOKUP(Scorekeeping!W118,'Standard Board Scores'!$R:$U,3,FALSE),VLOOKUP(Scorekeeping!W118,'Standard Board Scores'!$R:$U,4,FALSE)),\"\")),\"\")=0,\"\",IFERROR(IF(ISERROR(W118),\"\",IF(OR($D$9=\"Horizontal\",$D$9=\"Single Letter\"),INDEX('Current Board'!$B$2:$P$16,VLOOKUP(Scorekeeping!W118,'Standard Board Scores'!$R:$U,3,FALSE),VLOOKUP(Scorekeeping!W118,'Standard Board Scores'!$R:$U,4,FALSE)),\"\")),\"\")),\"\")","v":""},{"$f":"IF(W119<>\"\",IF(IFERROR(IF(X118=\"\",\"\",IF(OR($D$9=\"Horizontal\",$D$9=\"Single Letter\"),INDEX('Current Board'!$B$2:$P$16,VLOOKUP(Scorekeeping!X118,'Standard Board Scores'!$R:$U,3,FALSE),VLOOKUP(Scorekeeping!X118,'Standard Board Scores'!$R:$U,4,FALSE)),\"\")),\"\")=0,\"\",IFERROR(IF(ISERROR(X118),\"\",IF(OR($D$9=\"Horizontal\",$D$9=\"Single Letter\"),INDEX('Current Board'!$B$2:$P$16,VLOOKUP(Scorekeeping!X118,'Standard Board Scores'!$R:$U,3,FALSE),VLOOKUP(Scorekeeping!X118,'Standard Board Scores'!$R:$U,4,FALSE)),\"\")),\"\")),\"\")","v":""},{"$f":"IF(X119<>\"\",IF(IFERROR(IF(Y118=\"\",\"\",IF(OR($D$9=\"Horizontal\",$D$9=\"Single Letter\"),INDEX('Current Board'!$B$2:$P$16,VLOOKUP(Scorekeeping!Y118,'Standard Board Scores'!$R:$U,3,FALSE),VLOOKUP(Scorekeeping!Y118,'Standard Board Scores'!$R:$U,4,FALSE)),\"\")),\"\")=0,\"\",IFERROR(IF(ISERROR(Y118),\"\",IF(OR($D$9=\"Horizontal\",$D$9=\"Single Letter\"),INDEX('Current Board'!$B$2:$P$16,VLOOKUP(Scorekeeping!Y118,'Standard Board Scores'!$R:$U,3,FALSE),VLOOKUP(Scorekeeping!Y118,'Standard Board Scores'!$R:$U,4,FALSE)),\"\")),\"\")),\"\")","v":""}]
[null,null,null,null,null,null,null,null,null,null,{"$f":"IFERROR(VLOOKUP(K119,'Tiles Remaining'!$A:$C,3,FALSE),\"\")","v":""},{"$f":"IFERROR(VLOOKUP(L119,'Tiles Remaining'!$A:$C,3,FALSE),\"\")","v":""},{"$f":"IFERROR(VLOOKUP(M119,'Tiles Remaining'!$A:$C,3,FALSE),\"\")","v":""},{"$f":"IFERROR(VLOOKUP(N119,'Tiles Remaining'!$A:$C,3,FALSE),\"\")","v":""},{"$f":"IFERROR(VLOOKUP(O119,'Tiles Remaining'!$A:$C,3,FALSE),\"\")","v":""},{"$f":"IFERROR(VLOOKUP(P119,'Tiles Remaining'!$A:$C,3,FALSE),\"\")","v":""},{"$f":"IFERROR(VLOOKUP(Q119,'Tiles Remaining'!$A:$C,3,FALSE),\"\")","v":""},{"$f":"IFERROR(VLOOKUP(R119,'Tiles Remaining'!$A:$C,3,FALSE),\"\")","v":""},{"$f":"IFERROR(VLOOKUP(S119,'Tiles Remaining'!$A:$C,3,FALSE),\"\")","v":""},{"$f":"IFERROR(VLOOKUP(T119,'Tiles Remaining'!$A:$C,3,FALSE),\"\")","v":""},{"$f":"IFERROR(VLOOKUP(U119,'Tiles Remaining'!$A:$C,3,FALSE),\"\")","v":""},{"$f":"IFERROR(VLOOKUP(V119,'Tiles Remaining'!$A:$C,3,FALSE),\"\")","v":""},{"$f":"IFERROR(VLOOKUP(W119,'Tiles Remaining'!$A:$C,3,FALSE),\"\")","v":""},{"$f":"IFERROR(VLOOKUP(X119,'Tiles Remaining'!$A:$C,3,FALSE),\"\")","v":""},{"$f":"IFERROR(VLOOKUP(Y119,'Tiles Remaining'!$A:$C,3,FALSE),\"\")","v":""},{"$f":"SUM(K120:Y120)","v":0}]
[null,null,null,null,null,null,null,null,null,null,null,"Horizontal 6 - Side A"]
[null,null,null,null,null,null,null,null,null,null,null,1,2,3,4,5,6,7,8,9,10,11,12,13,14]
[null,null,null,null,null,null,null,null,null,null,{"$f":"I26","v":""},{"$f":"IF(AND(K123<>\"\",REPLACE(K123,1,1,\"\")<>\"2\",REPLACE(K123,1,1,\"\")<>\"1\"),CONCATENATE(LEFT(K123),VALUE(REPLACE(K123,1,1,\"\"))-1),\"\")","v":""},{"$f":"IF(AND(L123<>\"\",REPLACE(L123,1,1,\"\")<>\"2\",REPLACE(L123,1,1,\"\")<>\"1\"),CONCATENATE(LEFT(L123),VALUE(REPLACE(L123,1,1,\"\"))-1),\"\")","v":""},"","","","","","","","","","","",""]
[null,null,null,null,null,null,null,null,null,null,{"$f":"IF(IFERROR(IF(K123=\"\",\"\",IF(OR($D$9=\"Horizontal\",$D$9=\"Single Letter\"),INDEX('Current Board'!$B$2:$P$16,VLOOKUP(Scorekeeping!K123,'Standard Board Scores'!$R:$U,3,FALSE),VLOOKUP(Scorekeeping!K123,'Standard Board Scores'!$R:$U,4,FALSE)),\"\")),\"\")=0,\"\",IFERROR(IF(ISERROR(K123),\"\",IF(OR($D$9=\"Horizontal\",$D$9=\"Single Letter\"),INDEX('Current Board'!$B$2:$P$16,VLOOKUP(Scorekeeping!K123,'Standard Board Scores'!$R:$U,3,FALSE),VLOOKUP(Scorekeeping!K123,'Standard Board Scores'!$R:$U,4,FALSE)),\"\")),\"\"))","v":""},{"$f":"IF(K124<>\"\",IF(IFERROR(IF(L123=\"\",\"\",IF(OR($D$9=\"Horizontal\",$D$9=\"Single Letter\"),INDEX('Current Board'!$B$2:$P$16,VLOOKUP(Scorekeeping!L123,'Standard Board Scores'!$R:$U,3,FALSE),VLOOKUP(Scorekeeping!L123,'Standard Board Scores'!$R:$U,4,FALSE)),\"\")),\"\")=0,\"\",IFERROR(IF(ISERROR(L123),\"\",IF(OR($D$9=\"Horizontal\",$D$9=\"Single Letter\"),INDEX('Current Board'!$B$2:$P$16,VLOOKUP(Scorekeeping!L123,'Standard Board Scores'!$R:$U,3,FALSE),VLOOKUP(Scorekeeping!L123,'Standard Board Scores'!$R:$U,4,FALSE)),\"\")),\"\")),\"\")","v":""},{"$f":"IF(L124<>\"\",IF(IFERROR(IF(M123=\"\",\"\",IF(OR($D$9=\"Horizontal\",$D$9=\"Single Letter\"),INDEX('Current Board'!$B$2:$P$16,VLOOKUP(Scorekeeping!M123,'Standard Board Scores'!$R:$U,3,FALSE),VLOOKUP(Scorekeeping!M123,'Standard Board Scores'!$R:$U,4,FALSE)),\"\")),\"\")=0,\"\",IFERROR(IF(ISERROR(M123),\"\",IF(OR($D$9=\"Horizontal\",$D$9=\"Single Letter\"),INDEX('Current Board'!$B$2:$P$16,VLOOKUP(Scorekeeping!M123,'Standard Board Scores'!$R:$U,3,FALSE),VLOOKUP(Scorekeeping!M123,'Standard Board Scores'!$R:$U,4,FALSE)),\"\")),\"\")),\"\")","v":""},{"$f":"IF(M124<>\"\",IF(IFERROR(IF(N123=\"\",\"\",IF(OR($D$9=\"Horizontal\",$D$9=\"Single Letter\"),INDEX('Current Board'!$B$2:$P$16,VLOOKUP(Scorekeeping!N123,'Standard Board Scores'!$R:$U,3,FALSE),VLOOKUP(Scorekeeping!N123,'Standard Board Scores'!$R:$U,4,FALSE)),\"\")),\"\")=0,\"\",IFERROR(IF(ISERROR(N123),\"\",IF(OR($D$9=\"Horizontal\",$D$9=\"Single Letter\"),INDEX('Current Board'!$B$2:$P$16,VLOOKUP(Scorekeeping!N123,'Standard Board Scores'!$R:$U,3,FALSE),VLOOKUP(Scorekeeping!N123,'Standard Board Scores'!$R:$U,4,FALSE)),\"\")),\"\")),\"\")","v":""},{"$f":"IF(N124<>\"\",IF(IFERROR(IF(O123=\"\",\"\",IF(OR($D$9=\"Horizontal\",$D$9=\"Single Letter\"),INDEX('Current Board'!$B$2:$P$16,VLOOKUP(Scorekeeping!O123,'Standard Board Scores'!$R:$U,3,FALSE),VLOOKUP(Scorekeeping!O123,'Standard Board Scores'!$R:$U,4,FALSE)),\"\")),\"\")=0,\"\",IFERROR(IF(ISERROR(O123),\"\",IF(OR($D$9=\"Horizontal\",$D$9=\"Single Letter\"),INDEX('Current Board'!$B$2:$P$16,VLOOKUP(Scorekeeping!O123,'Standard Board Scores'!$R:$U,3,FALSE),VLOOKUP(Scorekeeping!O123,'Standard Board Scores'!$R:$U,4,FALSE)),\"\")),\"\")),\"\")","v":""},{"$f":"IF(O124<>\"\",IF(IFERROR(IF(P123=\"\",\"\",IF(OR($D$9=\"Horizontal\",$D$9=\"Single Letter\"),INDEX('Current Board'!$B$2:$P$16,VLOOKUP(Scorekeeping!P123,'Standard Board Scores'!$R:$U,3,FALSE),VLOOKUP(Scorekeeping!P123,'Standard Board Scores'!$R:$U,4,FALSE)),\"\")),\"\")=0,\"\",IFERROR(IF(ISERROR(P123),\"\",IF(OR($D$9=\"Horizontal\",$D$9=\"Single Letter\"),INDEX('Current Board'!$B$2:$P$16,VLOOKUP(Scorekeeping!P123,'Standard Board Scores'!$R:$U,3,FALSE),VLOOKUP(Scorekeeping!P123,'Standard Board Scores'!$R:$U,4,FALSE)),\"\")),\"\")),\"\")","v":""},{"$f":"IF(P124<>\"\",IF(IFERROR(IF(Q123=\"\",\"\",IF(OR($D$9=\"Horizontal\",$D$9=\"Single Letter\"),INDEX('Current Board'!$B$2:$P$16,VLOOKUP(Scorekeeping!Q123,'Standard Board Scores'!$R:$U,3,FALSE),VLOOKUP(Scorekeeping!Q123,'Standard Board Scores'!$R:$U,4,FALSE)),\"\")),\"\")=0,\"\",IFERROR(IF(ISERROR(Q123),\"\",IF(OR($D$9=\"Horizontal\",$D$9=\"Single Letter\"),INDEX('Current Board'!$B$2:$P$16,VLOOKUP(Scorekeeping!Q123,'Standard Board Scores'!$R:$U,3,FALSE),VLOOKUP(Scorekeeping!Q123,'Standard Board Scores'!$R:$U,4,FALSE)),\"\")),\"\")),\"\")","v":""},{"$f":"IF(Q124<>\"\",IF(IFERROR(IF(R123=\"\",\"\",IF(OR($D$9=\"Horizontal\",$D$9=\"Single Letter\"),INDEX('Current Board'!$B$2:$P$16,VLOOKUP(Scorekeeping!R123,'Standard Board Scores'!$R:$U,3,FALSE),VLOOKUP(Scorekeeping!R123,'Standard Board Scores'!$R:$U,4,FALSE)),\"\")),\"\")=0,\"\",IFERROR(IF(ISERROR(R123),\"\",IF(OR($D$9=\"Horizontal\",$D$9=\"Single Letter\"),INDEX('Current Board'!$B$2:$P$16,VLOOKUP(Scorekeeping!R123,'Standard Board Scores'!$R:$U,3,FALSE),VLOOKUP(Scorekeeping!R123,'Standard Board Scores'!$R:$U,4,FALSE)),\"\")),\"\")),\"\")","v":""},{"$f":"IF(R124<>\"\",IF(IFERROR(IF(S123=\"\",\"\",IF(OR($D$9=\"Horizontal\",$D$9=\"Single Letter\"),INDEX('Current Board'!$B$2:$P$16,VLOOKUP(Scorekeeping!S123,'Standard Board Scores'!$R:$U,3,FALSE),VLOOKUP(Scorekeeping!S123,'Standard Board Scores'!$R:$U,4,FALSE)),\"\")),\"\")=0,\"\",IFERROR(IF(ISERROR(S123),\"\",IF(OR($D$9=\"Horizontal\",$D$9=\"Single Letter\"),INDEX('Current Board'!$B$2:$P$16,VLOOKUP(Scorekeeping!S123,'Standard Board Scores'!$R:$U,3,FALSE),VLOOKUP(Scorekeeping!S123,'Standard Board Scores'!$R:$U,4,FALSE)),\"\")),\"\")),\"\")","v":""},{"$f":"IF(S124<>\"\",IF(IFERROR(IF(T123=\"\",\"\",IF(OR($D$9=\"Horizontal\",$D$9=\"Single Letter\"),INDEX('Current Board'!$B$2:$P$16,VLOOKUP(Scorekeeping!T123,'Standard Board Scores'!$R:$U,3,FALSE),VLOOKUP(Scorekeeping!T123,'Standard Board Scores'!$R:$U,4,FALSE)),\"\")),\"\")=0,\"\",IFERROR(IF(ISERROR(T123),\"\",IF(OR($D$9=\"Horizontal\",$D$9=\"Single Letter\"),INDEX('Current Board'!$B$2:$P$16,VLOOKUP(Scorekeeping!T123,'Standard Board Scores'!$R:$U,3,FALSE),VLOOKUP(Scorekeeping!T123,'Standard Board Scores'!$R:$U,4,FALSE)),\"\")),\"\")),\"\")","v":""},{"$f":"IF(T124<>\"\",IF(IFERROR(IF(U123=\"\",\"\",IF(OR($D$9=\"Horizontal\",$D$9=\"Single Letter\"),INDEX('Current Board'!$B$2:$P$16,VLOOKUP(Scorekeeping!U123,'Standard Board Scores'!$R:$U,3,FALSE),VLOOKUP(Scorekeeping!U123,'Standard Board Scores'!$R:$U,4,FALSE)),\"\")),\"\")=0,\"\",IFERROR(IF(ISERROR(U123),\"\",IF(OR($D$9=\"Horizontal\",$D$9=\"Single Letter\"),INDEX('Current Board'!$B$2:$P$16,VLOOKUP(Scorekeeping!U123,'Standard Board Scores'!$R:$U,3,FALSE),VLOOKUP(Scorekeeping!U123,'Standard Board Scores'!$R:$U,4,FALSE)),\"\")),\"\")),\"\")","v":""},{"$f":"IF(U124<>\"\",IF(IFERROR(IF(V123=\"\",\"\",IF(OR($D$9=\"Horizontal\",$D$9=\"Single Letter\"),INDEX('Current Board'!$B$2:$P$16,VLOOKUP(Scorekeeping!V123,'Standard Board Scores'!$R:$U,3,FALSE),VLOOKUP(Scorekeeping!V123,'Standard Board Scores'!$R:$U,4,FALSE)),\"\")),\"\")=0,\"\",IFERROR(IF(ISERROR(V123),\"\",IF(OR($D$9=\"Horizontal\",$D$9=\"Single Letter\"),INDEX('Current Board'!$B$2:$P$16,VLOOKUP(Scorekeeping!V123,'Standard Board Scores'!$R:$U,3,FALSE),VLOOKUP(Scorekeeping!V123,'Standard Board Scores'!$R:$U,4,FALSE)),\"\")),\"\")),\"\")","v":""},{"$f":"IF(V124<>\"\",IF(IFERROR(IF(W123=\"\",\"\",IF(OR($D$9=\"Horizontal\",$D$9=\"Single Letter\"),INDEX('Current Board'!$B$2:$P$16,VLOOKUP(Scorekeeping!W123,'Standard Board Scores'!$R:$U,3,FALSE),VLOOKUP(Scorekeeping!W123,'Standard Board Scores'!$R:$U,4,FALSE)),\"\")),\"\")=0,\"\",IFERROR(IF(ISERROR(W123),\"\",IF(OR($D$9=\"Horizontal\",$D$9=\"Single Letter\"),INDEX('Current Board'!$B$2:$P$16,VLOOKUP(Scorekeeping!W123,'Standard Board Scores'!$R:$U,3,FALSE),VLOOKUP(Scorekeeping!W123,'Standard Board Scores'!$R:$U,4,FALSE)),\"\")),\"\")),\"\")","v":""},{"$f":"IF(W124<>\"\",IF(IFERROR(IF(X123=\"\",\"\",IF(OR($D$9=\"Horizontal\",$D$9=\"Single Letter\"),INDEX('Current Board'!$B$2:$P$16,VLOOKUP(Scorekeeping!X123,'Standard Board Scores'!$R:$U,3,FALSE),VLOOKUP(Scorekeeping!X123,'Standard Board Scores'!$R:$U,4,FALSE)),\"\")),\"\")=0,\"\",IFERROR(IF(ISERROR(X123),\"\",IF(OR($D$9=\"Horizontal\",$D$9=\"Single Letter\"),INDEX('Current Board'!$B$2:$P$16,VLOOKUP(Scorekeeping!X123,'Standard Board Scores'!$R:$U,3,FALSE),VLOOKUP(Scorekeeping!X123,'Standard Board Scores'!$R:$U,4,FALSE)),\"\")),\"\")),\"\")","v":""},{"$f":"IF(X124<>\"\",IF(IFERROR(IF(Y123=\"\",\"\",IF(OR($D$9=\"Horizontal\",$D$9=\"Single Letter\"),INDEX('Current Board'!$B$2:$P$16,VLOOKUP(Scorekeeping!Y123,'Standard Board Scores'!$R:$U,3,FALSE),VLOOKUP(Scorekeeping!Y123,'Standard Board Scores'!$R:$U,4,FALSE)),\"\")),\"\")=0,\"\",IFERROR(IF(ISERROR(Y123),\"\",IF(OR($D$9=\"Horizontal\",$D$9=\"Single Letter\"),INDEX('Current Board'!$B$2:$P$16,VLOOKUP(Scorekeeping!Y123,'Standard Board Scores'!$R:$U,3,FALSE),VLOOKUP(Scorekeeping!Y123,'Standard Board Scores'!$R:$U,4,FALSE)),\"\")),\"\")),\"\")","v":""}]
[null,null,null,null,null,null,null,null,null,null,{"$f":"IFERROR(VLOOKUP(K124,'Tiles Remaining'!$A:$C,3,FALSE),\"\")","v":""},{"$f":"IFERROR(VLOOKUP(L124,'Tiles Remaining'!$A:$C,3,FALSE),\"\")","v":""},{"$f":"IFERROR(VLOOKUP(M124,'Tiles Remaining'!$A:$C,3,FALSE),\"\")","v":""},{"$f":"IFERROR(VLOOKUP(N124,'Tiles Remaining'!$A:$C,3,FALSE),\"\")","v":""},{"$f":"IFERROR(VLOOKUP(O124,'Tiles Remaining'!$A:$C,3,FALSE),\"\")","v":""},{"$f":"IFERROR(VLOOKUP(P124,'Tiles Remaining'!$A:$C,3,FALSE),\"\")","v":""},{"$f":"IFERROR(VLOOKUP(Q124,'Tiles Remaining'!$A:$C,3,FALSE),\"\")","v":""},{"$f":"IFERROR(VLOOKUP(R124,'Tiles Remaining'!$A:$C,3,FALSE),\"\")","v":""},{"$f":"IFERROR(VLOOKUP(S124,'Tiles Remaining'!$A:$C,3,FALSE),\"\")","v":""},{"$f":"IFERROR(VLOOKUP(T124,'Tiles Remaining'!$A:$C,3,FALSE),\"\")","v":""},{"$f":"IFERROR(VLOOKUP(U124,'Tiles Remaining'!$A:$C,3,FALSE),\"\")","v":""},{"$f":"IFERROR(VLOOKUP(V124,'Tiles Remaining'!$A:$C,3,FALSE),\"\")","v":""},{"$f":"IFERROR(VLOOKUP(W124,'Tiles Remaining'!$A:$C,3,FALSE),\"\")","v":""},{"$f":"IFERROR(VLOOKUP(X124,'Tiles Remaining'!$A:$C,3,FALSE),\"\")","v":""},{"$f":"IFERROR(VLOOKUP(Y124,'Tiles Remaining'!$A:$C,3,FALSE),\"\")","v":""},{"$f":"SUM(K125:Y125)","v":0}]
[null,null,null,null,null,null,null,null,null,null,null,"Horizontal 7 - Side A"]
[null,null,null,null,null,null,null,null,null,null,null,1,2,3,4,5,6,7,8,9,10,11,12,13,14]
[null,null,null,null,null,null,null,null,null,null,{"$f":"J26","v":""},{"$f":"IF(AND(K128<>\"\",REPLACE(K128,1,1,\"\")<>\"2\",REPLACE(K128,1,1,\"\")<>\"1\"),CONCATENATE(LEFT(K128),VALUE(REPLACE(K128,1,1,\"\"))-1),\"\")","v":""},{"$f":"IF(AND(L128<>\"\",REPLACE(L128,1,1,\"\")<>\"2\",REPLACE(L128,1,1,\"\")<>\"1\"),CONCATENATE(LEFT(L128),VALUE(REPLACE(L128,1,1,\"\"))-1),\"\")","v":""},"","","","","","","","","","","",""]
[null,null,null,null,null,null,null,null,null,null,{"$f":"IF(IFERROR(IF(K128=\"\",\"\",IF(OR($D$9=\"Horizontal\",$D$9=\"Single Letter\"),INDEX('Current Board'!$B$2:$P$16,VLOOKUP(Scorekeeping!K128,'Standard Board Scores'!$R:$U,3,FALSE),VLOOKUP(Scorekeeping!K128,'Standard Board Scores'!$R:$U,4,FALSE)),\"\")),\"\")=0,\"\",IFERROR(IF(ISERROR(K128),\"\",IF(OR($D$9=\"Horizontal\",$D$9=\"Single Letter\"),INDEX('Current Board'!$B$2:$P$16,VLOOKUP(Scorekeeping!K128,'Standard Board Scores'!$R:$U,3,FALSE),VLOOKUP(Scorekeeping!K128,'Standard Board Scores'!$R:$U,4,FALSE)),\"\")),\"\"))","v":""},{"$f":"IF(K129<>\"\",IF(IFERROR(IF(L128=\"\",\"\",IF(OR($D$9=\"Horizontal\",$D$9=\"Single Letter\"),INDEX('Current Board'!$B$2:$P$16,VLOOKUP(Scorekeeping!L128,'Standard Board Scores'!$R:$U,3,FALSE),VLOOKUP(Scorekeeping!L128,'Standard Board Scores'!$R:$U,4,FALSE)),\"\")),\"\")=0,\"\",IFERROR(IF(ISERROR(L128),\"\",IF(OR($D$9=\"Horizontal\",$D$9=\"Single Letter\"),INDEX('Current Board'!$B$2:$P$16,VLOOKUP(Scorekeeping!L128,'Standard Board Scores'!$R:$U,3,FALSE),VLOOKUP(Scorekeeping!L128,'Standard Board Scores'!$R:$U,4,FALSE)),\"\")),\"\")),\"\")","v":""},{"$f":"IF(L129<>\"\",IF(IFERROR(IF(M128=\"\",\"\",IF(OR($D$9=\"Horizontal\",$D$9=\"Single Letter\"),INDEX('Current Board'!$B$2:$P$16,VLOOKUP(Scorekeeping!M128,'Standard Board Scores'!$R:$U,3,FALSE),VLOOKUP(Scorekeeping!M128,'Standard Board Scores'!$R:$U,4,FALSE)),\"\")),\"\")=0,\"\",IFERROR(IF(ISERROR(M128),\"\",IF(OR($D$9=\"Horizontal\",$D$9=\"Single Letter\"),INDEX('Current Board'!$B$2:$P$16,VLOOKUP(Scorekeeping!M128,'Standard Board Scores'!$R:$U,3,FALSE),VLOOKUP(Scorekeeping!M128,'Standard Board Scores'!$R:$U,4,FALSE)),\"\")),\"\")),\"\")","v":""},{"$f":"IF(M129<>\"\",IF(IFERROR(IF(N128=\"\",\"\",IF(OR($D$9=\"Horizontal\",$D$9=\"Single Letter\"),INDEX('Current Board'!$B$2:$P$16,VLOOKUP(Scorekeeping!N128,'Standard Board Scores'!$R:$U,3,FALSE),VLOOKUP(Scorekeeping!N128,'Standard Board Scores'!$R:$U,4,FALSE)),\"\")),\"\")=0,\"\",IFERROR(IF(ISERROR(N128),\"\",IF(OR($D$9=\"Horizontal\",$D$9=\"Single Letter\"),INDEX('Current Board'!$B$2:$P$16,VLOOKUP(Scorekeeping!N128,'Standard Board Scores'!$R:$U,3,FALSE),VLOOKUP(Scorekeeping!N128,'Standard Board Scores'!$R:$U,4,FALSE)),\"\")),\"\")),\"\")","v":""},{"$f":"IF(N129<>\"\",IF(IFERROR(IF(O128=\"\",\"\",IF(OR($D$9=\"Horizontal\",$D$9=\"Single Letter\"),INDEX('Current Board'!$B$2:$P$16,VLOOKUP(Scorekeeping!O128,'Standard Board Scores'!$R:$U,3,FALSE),VLOOKUP(Scorekeeping!O128,'Standard Board Scores'!$R:$U,4,FALSE)),\"\")),\"\")=0,\"\",IFERROR(IF(ISERROR(O128),\"\",IF(OR($D$9=\"Horizontal\",$D$9=\"Single Letter\"),INDEX('Current Board'!$B$2:$P$16,VLOOKUP(Scorekeeping!O128,'Standard Board Scores'!$R:$U,3,FALSE),VLOOKUP(Scorekeeping!O128,'Standard Board Scores'!$R:$U,4,FALSE)),\"\")),\"\")),\"\")","v":""},{"$f":"IF(O129<>\"\",IF(IFERROR(IF(P128=\"\",\"\",IF(OR($D$9=\"Horizontal\",$D$9=\"Single Letter\"),INDEX('Current Board'!$B$2:$P$16,VLOOKUP(Scorekeeping!P128,'Standard Board Scores'!$R:$U,3,FALSE),VLOOKUP(Scorekeeping!P128,'Standard Board Scores'!$R:$U,4,FALSE)),\"\")),\"\")=0,\"\",IFERROR(IF(ISERROR(P128),\"\",IF(OR($D$9=\"Horizontal\",$D$9=\"Single Letter\"),INDEX('Current Board'!$B$2:$P$16,VLOOKUP(Scorekeeping!P128,'Standard Board Scores'!$R:$U,3,FALSE),VLOOKUP(Scorekeeping!P128,'Standard Board Scores'!$R:$U,4,FALSE)),\"\")),\"\")),\"\")","v":""},{"$f":"IF(P129<>\"\",IF(IFERROR(IF(Q128=\"\",\"\",IF(OR($D$9=\"Horizontal\",$D$9=\"Single Letter\"),INDEX('Current Board'!$B$2:$P$16,VLOOKUP(Scorekeeping!Q128,'Standard Board Scores'!$R:$U,3,FALSE),VLOOKUP(Scorekeeping!Q128,'Standard Board Scores'!$R:$U,4,FALSE)),\"\")),\"\")=0,\"\",IFERROR(IF(ISERROR(Q128),\"\",IF(OR($D$9=\"Horizontal\",$D$9=\"Single Letter\"),INDEX('Current Board'!$B$2:$P$16,VLOOKUP(Scorekeeping!Q128,'Standard Board Scores'!$R:$U,3,FALSE),VLOOKUP(Scorekeeping!Q128,'Standard Board Scores'!$R:$U,4,FALSE)),\"\")),\"\")),\"\")","v":""},{"$f":"IF(Q129<>\"\",IF(IFERROR(IF(R128=\"\",\"\",IF(OR($D$9=\"Horizontal\",$D$9=\"Single Letter\"),INDEX('Current Board'!$B$2:$P$16,VLOOKUP(Scorekeeping!R128,'Standard Board Scores'!$R:$U,3,FALSE),VLOOKUP(Scorekeeping!R128,'Standard Board Scores'!$R:$U,4,FALSE)),\"\")),\"\")=0,\"\",IFERROR(IF(ISERROR(R128),\"\",IF(OR($D$9=\"Horizontal\",$D$9=\"Single Letter\"),INDEX('Current Board'!$B$2:$P$16,VLOOKUP(Scorekeeping!R128,'Standard Board Scores'!$R:$U,3,FALSE),VLOOKUP(Scorekeeping!R128,'Standard Board Scores'!$R:$U,4,FALSE)),\"\")),\"\")),\"\")","v":""},{"$f":"IF(R129<>\"\",IF(IFERROR(IF(S128=\"\",\"\",IF(OR($D$9=\"Horizontal\",$D$9=\"Single Letter\"),INDEX('Current Board'!$B$2:$P$16,VLOOKUP(Scorekeeping!S128,'Standard Board Scores'!$R:$U,3,FALSE),VLOOKUP(Scorekeeping!S128,'Standard Board Scores'!$R:$U,4,FALSE)),\"\")),\"\")=0,\"\",IFERROR(IF(ISERROR(S128),\"\",IF(OR($D$9=\"Horizontal\",$D$9=\"Single Letter\"),INDEX('Current Board'!$B$2:$P$16,VLOOKUP(Scorekeeping!S128,'Standard Board Scores'!$R:$U,3,FALSE),VLOOKUP(Scorekeeping!S128,'Standard Board Scores'!$R:$U,4,FALSE)),\"\")),\"\")),\"\")","v":""},{"$f":"IF(S129<>\"\",IF(IFERROR(IF(T128=\"\",\"\",IF(OR($D$9=\"Horizontal\",$D$9=\"Single Letter\"),INDEX('Current Board'!$B$2:$P$16,VLOOKUP(Scorekeeping!T128,'Standard Board Scores'!$R:$U,3,FALSE),VLOOKUP(Scorekeeping!T128,'Standard Board Scores'!$R:$U,4,FALSE)),\"\")),\"\")=0,\"\",IFERROR(IF(ISERROR(T128),\"\",IF(OR($D$9=\"Horizontal\",$D$9=\"Single Letter\"),INDEX('Current Board'!$B$2:$P$16,VLOOKUP(Scorekeeping!T128,'Standard Board Scores'!$R:$U,3,FALSE),VLOOKUP(Scorekeeping!T128,'Standard Board Scores'!$R:$U,4,FALSE)),\"\")),\"\")),\"\")","v":""},{"$f":"IF(T129<>\"\",IF(IFERROR(IF(U128=\"\",\"\",IF(OR($D$9=\"Horizontal\",$D$9=\"Single Letter\"),INDEX('Current Board'!$B$2:$P$16,VLOOKUP(Scorekeeping!U128,'Standard Board Scores'!$R:$U,3,FALSE),VLOOKUP(Scorekeeping!U128,'Standard Board Scores'!$R:$U,4,FALSE)),\"\")),\"\")=0,\"\",IFERROR(IF(ISERROR(U128),\"\",IF(OR($D$9=\"Horizontal\",$D$9=\"Single Letter\"),INDEX('Current Board'!$B$2:$P$16,VLOOKUP(Scorekeeping!U128,'Standard Board Scores'!$R:$U,3,FALSE),VLOOKUP(Scorekeeping!U128,'Standard Board Scores'!$R:$U,4,FALSE)),\"\")),\"\")),\"\")","v":""},{"$f":"IF(U129<>\"\",IF(IFERROR(IF(V128=\"\",\"\",IF(OR($D$9=\"Horizontal\",$D$9=\"Single Letter\"),INDEX('Current Board'!$B$2:$P$16,VLOOKUP(Scorekeeping!V128,'Standard Board Scores'!$R:$U,3,FALSE),VLOOKUP(Scorekeeping!V128,'Standard Board Scores'!$R:$U,4,FALSE)),\"\")),\"\")=0,\"\",IFERROR(IF(ISERROR(V128),\"\",IF(OR($D$9=\"Horizontal\",$D$9=\"Single Letter\"),INDEX('Current Board'!$B$2:$P$16,VLOOKUP(Scorekeeping!V128,'Standard Board Scores'!$R:$U,3,FALSE),VLOOKUP(Scorekeeping!V128,'Standard Board Scores'!$R:$U,4,FALSE)),\"\")),\"\")),\"\")","v":""},{"$f":"IF(V129<>\"\",IF(IFERROR(IF(W128=\"\",\"\",IF(OR($D$9=\"Horizontal\",$D$9=\"Single Letter\"),INDEX('Current Board'!$B$2:$P$16,VLOOKUP(Scorekeeping!W128,'Standard Board Scores'!$R:$U,3,FALSE),VLOOKUP(Scorekeeping!W128,'Standard Board Scores'!$R:$U,4,FALSE)),\"\")),\"\")=0,\"\",IFERROR(IF(ISERROR(W128),\"\",IF(OR($D$9=\"Horizontal\",$D$9=\"Single Letter\"),INDEX('Current Board'!$B$2:$P$16,VLOOKUP(Scorekeeping!W128,'Standard Board Scores'!$R:$U,3,FALSE),VLOOKUP(Scorekeeping!W128,'Standard Board Scores'!$R:$U,4,FALSE)),\"\")),\"\")),\"\")","v":""},{"$f":"IF(W129<>\"\",IF(IFERROR(IF(X128=\"\",\"\",IF(OR($D$9=\"Horizontal\",$D$9=\"Single Letter\"),INDEX('Current Board'!$B$2:$P$16,VLOOKUP(Scorekeeping!X128,'Standard Board Scores'!$R:$U,3,FALSE),VLOOKUP(Scorekeeping!X128,'Standard Board Scores'!$R:$U,4,FALSE)),\"\")),\"\")=0,\"\",IFERROR(IF(ISERROR(X128),\"\",IF(OR($D$9=\"Horizontal\",$D$9=\"Single Letter\"),INDEX('Current Board'!$B$2:$P$16,VLOOKUP(Scorekeeping!X128,'Standard Board Scores'!$R:$U,3,FALSE),VLOOKUP(Scorekeeping!X128,'Standard Board Scores'!$R:$U,4,FALSE)),\"\")),\"\")),\"\")","v":""},{"$f":"IF(X129<>\"\",IF(IFERROR(IF(Y128=\"\",\"\",IF(OR($D$9=\"Horizontal\",$D$9=\"Single Letter\"),INDEX('Current Board'!$B$2:$P$16,VLOOKUP(Scorekeeping!Y128,'Standard Board Scores'!$R:$U,3,FALSE),VLOOKUP(Scorekeeping!Y128,'Standard Board Scores'!$R:$U,4,FALSE)),\"\")),\"\")=0,\"\",IFERROR(IF(ISERROR(Y128),\"\",IF(OR($D$9=\"Horizontal\",$D$9=\"Single Letter\"),INDEX('Current Board'!$B$2:$P$16,VLOOKUP(Scorekeeping!Y128,'Standard Board Scores'!$R:$U,3,FALSE),VLOOKUP(Scorekeeping!Y128,'Standard Board Scores'!$R:$U,4,FALSE)),\"\")),\"\")),\"\")","v":""}]
[null,null,null,null,null,null,null,null,null,null,{"$f":"IFERROR(VLOOKUP(K129,'Tiles Remaining'!$A:$C,3,FALSE),\"\")","v":""},{"$f":"IFERROR(VLOOKUP(L129,'Tiles Remaining'!$A:$C,3,FALSE),\"\")","v":""},{"$f":"IFERROR(VLOOKUP(M129,'Tiles Remaining'!$A:$C,3,FALSE),\"\")","v":""},{"$f":"IFERROR(VLOOKUP(N129,'Tiles Remaining'!$A:$C,3,FALSE),\"\")","v":""},{"$f":"IFERROR(VLOOKUP(O129,'Tiles Remaining'!$A:$C,3,FALSE),\"\")","v":""},{"$f":"IFERROR(VLOOKUP(P129,'Tiles Remaining'!$A:$C,3,FALSE),\"\")","v":""},{"$f":"IFERROR(VLOOKUP(Q129,'Tiles Remaining'!$A:$C,3,FALSE),\"\")","v":""},{"$f":"IFERROR(VLOOKUP(R129,'Tiles Remaining'!$A:$C,3,FALSE),\"\")","v":""},{"$f":"IFERROR(VLOOKUP(S129,'Tiles Remaining'!$A:$C,3,FALSE),\"\")","v":""},{"$f":"IFERROR(VLOOKUP(T129,'Tiles Remaining'!$A:$C,3,FALSE),\"\")","v":""},{"$f":"IFERROR(VLOOKUP(U129,'Tiles Remaining'!$A:$C,3,FALSE),\"\")","v":""},{"$f":"IFERROR(VLOOKUP(V129,'Tiles Remaining'!$A:$C,3,FALSE),\"\")","v":""},{"$f":"IFERROR(VLOOKUP(W129,'Tiles Remaining'!$A:$C,3,FALSE),\"\")","v":""},{"$f":"IFERROR(VLOOKUP(X129,'Tiles Remaining'!$A:$C,3,FALSE),\"\")","v":""},{"$f":"IFERROR(VLOOKUP(Y129,'Tiles Remaining'!$A:$C,3,FALSE),\"\")","v":""},{"$f":"SUM(K130:Y130)","v":0}]
[null,null,null,null,null,null,null,null,null,null,null,"Horizontal 8 - Side B"]
[null,null,null,null,null,null,null,null,null,null,null,1,2,3,4,5,6,7,8,9,10,11,12,13,14]
[null,null,null,null,null,null,null,null,null,null,{"$f":"D28","v":""},{"$f":"IF(AND(K133<>\"\",REPLACE(K133,1,1,\"\")<>\"16\",REPLACE(K133,1,1,\"\")<>\"17\"),CONCATENATE(LEFT(K133),VALUE(REPLACE(K133,1,1,\"\"))+1),\"\")","v":""},{"$f":"IF(AND(L133<>\"\",REPLACE(L133,1,1,\"\")<>\"16\",REPLACE(L133,1,1,\"\")<>\"17\"),CONCATENATE(LEFT(L133),VALUE(REPLACE(L133,1,1,\"\"))+1),\"\")","v":""},"","","","","","","","","","","",""]
[null,null,null,null,null,null,null,null,null,null,{"$f":"IF(IFERROR(IF(K133=\"\",\"\",IF(OR($D$9=\"Horizontal\",$D$9=\"Single Letter\"),INDEX('Current Board'!$B$2:$P$16,VLOOKUP(Scorekeeping!K133,'Standard Board Scores'!$R:$U,3,FALSE),VLOOKUP(Scorekeeping!K133,'Standard Board Scores'!$R:$U,4,FALSE)),\"\")),\"\")=0,\"\",IFERROR(IF(ISERROR(K133),\"\",IF(OR($D$9=\"Horizontal\",$D$9=\"Single Letter\"),INDEX('Current Board'!$B$2:$P$16,VLOOKUP(Scorekeeping!K133,'Standard Board Scores'!$R:$U,3,FALSE),VLOOKUP(Scorekeeping!K133,'Standard Board Scores'!$R:$U,4,FALSE)),\"\")),\"\"))","v":""},{"$f":"IF(K134<>\"\",IF(IFERROR(IF(L133=\"\",\"\",IF(OR($D$9=\"Horizontal\",$D$9=\"Single Letter\"),INDEX('Current Board'!$B$2:$P$16,VLOOKUP(Scorekeeping!L133,'Standard Board Scores'!$R:$U,3,FALSE),VLOOKUP(Scorekeeping!L133,'Standard Board Scores'!$R:$U,4,FALSE)),\"\")),\"\")=0,\"\",IFERROR(IF(ISERROR(L133),\"\",IF(OR($D$9=\"Horizontal\",$D$9=\"Single Letter\"),INDEX('Current Board'!$B$2:$P$16,VLOOKUP(Scorekeeping!L133,'Standard Board Scores'!$R:$U,3,FALSE),VLOOKUP(Scorekeeping!L133,'Standard Board Scores'!$R:$U,4,FALSE)),\"\")),\"\")),\"\")","v":""},{"$f":"IF(L134<>\"\",IF(IFERROR(IF(M133=\"\",\"\",IF(OR($D$9=\"Horizontal\",$D$9=\"Single Letter\"),INDEX('Current Board'!$B$2:$P$16,VLOOKUP(Scorekeeping!M133,'Standard Board Scores'!$R:$U,3,FALSE),VLOOKUP(Scorekeeping!M133,'Standard Board Scores'!$R:$U,4,FALSE)),\"\")),\"\")=0,\"\",IFERROR(IF(ISERROR(M133),\"\",IF(OR($D$9=\"Horizontal\",$D$9=\"Single Letter\"),INDEX('Current Board'!$B$2:$P$16,VLOOKUP(Scorekeeping!M133,'Standard Board Scores'!$R:$U,3,FALSE),VLOOKUP(Scorekeeping!M133,'Standard Board Scores'!$R:$U,4,FALSE)),\"\")),\"\")),\"\")","v":""},{"$f":"IF(M134<>\"\",IF(IFERROR(IF(N133=\"\",\"\",IF(OR($D$9=\"Horizontal\",$D$9=\"Single Letter\"),INDEX('Current Board'!$B$2:$P$16,VLOOKUP(Scorekeeping!N133,'Standard Board Scores'!$R:$U,3,FALSE),VLOOKUP(Scorekeeping!N133,'Standard Board Scores'!$R:$U,4,FALSE)),\"\")),\"\")=0,\"\",IFERROR(IF(ISERROR(N133),\"\",IF(OR($D$9=\"Horizontal\",$D$9=\"Single Letter\"),INDEX('Current Board'!$B$2:$P$16,VLOOKUP(Scorekeeping!N133,'Standard Board Scores'!$R:$U,3,FALSE),VLOOKUP(Scorekeeping!N133,'Standard Board Scores'!$R:$U,4,FALSE)),\"\")),\"\")),\"\")","v":""},{"$f":"IF(N134<>\"\",IF(IFERROR(IF(O133=\"\",\"\",IF(OR($D$9=\"Horizontal\",$D$9=\"Single Letter\"),INDEX('Current Board'!$B$2:$P$16,VLOOKUP(Scorekeeping!O133,'Standard Board Scores'!$R:$U,3,FALSE),VLOOKUP(Scorekeeping!O133,'Standard Board Scores'!$R:$U,4,FALSE)),\"\")),\"\")=0,\"\",IFERROR(IF(ISERROR(O133),\"\",IF(OR($D$9=\"Horizontal\",$D$9=\"Single Letter\"),INDEX('Current Board'!$B$2:$P$16,VLOOKUP(Scorekeeping!O133,'Standard Board Scores'!$R:$U,3,FALSE),VLOOKUP(Scorekeeping!O133,'Standard Board Scores'!$R:$U,4,FALSE)),\"\")),\"\")),\"\")","v":""},{"$f":"IF(O134<>\"\",IF(IFERROR(IF(P133=\"\",\"\",IF(OR($D$9=\"Horizontal\",$D$9=\"Single Letter\"),INDEX('Current Board'!$B$2:$P$16,VLOOKUP(Scorekeeping!P133,'Standard Board Scores'!$R:$U,3,FALSE),VLOOKUP(Scorekeeping!P133,'Standard Board Scores'!$R:$U,4,FALSE)),\"\")),\"\")=0,\"\",IFERROR(IF(ISERROR(P133),\"\",IF(OR($D$9=\"Horizontal\",$D$9=\"Single Letter\"),INDEX('Current Board'!$B$2:$P$16,VLOOKUP(Scorekeeping!P133,'Standard Board Scores'!$R:$U,3,FALSE),VLOOKUP(Scorekeeping!P133,'Standard Board Scores'!$R:$U,4,FALSE)),\"\")),\"\")),\"\")","v":""},{"$f":"IF(P134<>\"\",IF(IFERROR(IF(Q133=\"\",\"\",IF(OR($D$9=\"Horizontal\",$D$9=\"Single Letter\"),INDEX('Current Board'!$B$2:$P$16,VLOOKUP(Scorekeeping!Q133,'Standard Board Scores'!$R:$U,3,FALSE),VLOOKUP(Scorekeeping!Q133,'Standard Board Scores'!$R:$U,4,FALSE)),\"\")),\"\")=0,\"\",IFERROR(IF(ISERROR(Q133),\"\",IF(OR($D$9=\"Horizontal\",$D$9=\"Single Letter\"),INDEX('Current Board'!$B$2:$P$16,VLOOKUP(Scorekeeping!Q133,'Standard Board Scores'!$R:$U,3,FALSE),VLOOKUP(Scorekeeping!Q133,'Standard Board Scores'!$R:$U,4,FALSE)),\"\")),\"\")),\"\")","v":""},{"$f":"IF(Q134<>\"\",IF(IFERROR(IF(R133=\"\",\"\",IF(OR($D$9=\"Horizontal\",$D$9=\"Single Letter\"),INDEX('Current Board'!$B$2:$P$16,VLOOKUP(Scorekeeping!R133,'Standard Board Scores'!$R:$U,3,FALSE),VLOOKUP(Scorekeeping!R133,'Standard Board Scores'!$R:$U,4,FALSE)),\"\")),\"\")=0,\"\",IFERROR(IF(ISERROR(R133),\"\",IF(OR($D$9=\"Horizontal\",$D$9=\"Single Letter\"),INDEX('Current Board'!$B$2:$P$16,VLOOKUP(Scorekeeping!R133,'Standard Board Scores'!$R:$U,3,FALSE),VLOOKUP(Scorekeeping!R133,'Standard Board Scores'!$R:$U,4,FALSE)),\"\")),\"\")),\"\")","v":""},{"$f":"IF(R134<>\"\",IF(IFERROR(IF(S133=\"\",\"\",IF(OR($D$9=\"Horizontal\",$D$9=\"Single Letter\"),INDEX('Current Board'!$B$2:$P$16,VLOOKUP(Scorekeeping!S133,'Standard Board Scores'!$R:$U,3,FALSE),VLOOKUP(Scorekeeping!S133,'Standard Board Scores'!$R:$U,4,FALSE)),\"\")),\"\")=0,\"\",IFERROR(IF(ISERROR(S133),\"\",IF(OR($D$9=\"Horizontal\",$D$9=\"Single Letter\"),INDEX('Current Board'!$B$2:$P$16,VLOOKUP(Scorekeeping!S133,'Standard Board Scores'!$R:$U,3,FALSE),VLOOKUP(Scorekeeping!S133,'Standard Board Scores'!$R:$U,4,FALSE)),\"\")),\"\")),\"\")","v":""},{"$f":"IF(S134<>\"\",IF(IFERROR(IF(T133=\"\",\"\",IF(OR($D$9=\"Horizontal\",$D$9=\"Single Letter\"),INDEX('Current Board'!$B$2:$P$16,VLOOKUP(Scorekeeping!T133,'Standard Board Scores'!$R:$U,3,FALSE),VLOOKUP(Scorekeeping!T133,'Standard Board Scores'!$R:$U,4,FALSE)),\"\")),\"\")=0,\"\",IFERROR(IF(ISERROR(T133),\"\",IF(OR($D$9=\"Horizontal\",$D$9=\"Single Letter\"),INDEX('Current Board'!$B$2:$P$16,VLOOKUP(Scorekeeping!T133,'Standard Board Scores'!$R:$U,3,FALSE),VLOOKUP(Scorekeeping!T133,'Standard Board Scores'!$R:$U,4,FALSE)),\"\")),\"\")),\"\")","v":""},{"$f":"IF(T134<>\"\",IF(IFERROR(IF(U133=\"\",\"\",IF(OR($D$9=\"Horizontal\",$D$9=\"Single Letter\"),INDEX('Current Board'!$B$2:$P$16,VLOOKUP(Scorekeeping!U133,'Standard Board Scores'!$R:$U,3,FALSE),VLOOKUP(Scorekeeping!U133,'Standard Board Scores'!$R:$U,4,FALSE)),\"\")),\"\")=0,\"\",IFERROR(IF(ISERROR(U133),\"\",IF(OR($D$9=\"Horizontal\",$D$9=\"Single Letter\"),INDEX('Current Board'!$B$2:$P$16,VLOOKUP(Scorekeeping!U133,'Standard Board Scores'!$R:$U,3,FALSE),VLOOKUP(Scorekeeping!U133,'Standard Board Scores'!$R:$U,4,FALSE)),\"\")),\"\")),\"\")","v":""},{"$f":"IF(U134<>\"\",IF(IFERROR(IF(V133=\"\",\"\",IF(OR($D$9=\"Horizontal\",$D$9=\"Single Letter\"),INDEX('Current Board'!$B$2:$P$16,VLOOKUP(Scorekeeping!V133,'Standard Board Scores'!$R:$U,3,FALSE),VLOOKUP(Scorekeeping!V133,'Standard Board Scores'!$R:$U,4,FALSE)),\"\")),\"\")=0,\"\",IFERROR(IF(ISERROR(V133),\"\",IF(OR($D$9=\"Horizontal\",$D$9=\"Single Letter\"),INDEX('Current Board'!$B$2:$P$16,VLOOKUP(Scorekeeping!V133,'Standard Board Scores'!$R:$U,3,FALSE),VLOOKUP(Scorekeeping!V133,'Standard Board Scores'!$R:$U,4,FALSE)),\"\")),\"\")),\"\")","v":""},{"$f":"IF(V134<>\"\",IF(IFERROR(IF(W133=\"\",\"\",IF(OR($D$9=\"Horizontal\",$D$9=\"Single Letter\"),INDEX('Current Board'!$B$2:$P$16,VLOOKUP(Scorekeeping!W133,'Standard Board Scores'!$R:$U,3,FALSE),VLOOKUP(Scorekeeping!W133,'Standard Board Scores'!$R:$U,4,FALSE)),\"\")),\"\")=0,\"\",IFERROR(IF(ISERROR(W133),\"\",IF(OR($D$9=\"Horizontal\",$D$9=\"Single Letter\"),INDEX('Current Board'!$B$2:$P$16,VLOOKUP(Scorekeeping!W133,'Standard Board Scores'!$R:$U,3,FALSE),VLOOKUP(Scorekeeping!W133,'Standard Board Scores'!$R:$U,4,FALSE)),\"\")),\"\")),\"\")","v":""},{"$f":"IF(W134<>\"\",IF(IFERROR(IF(X133=\"\",\"\",IF(OR($D$9=\"Horizontal\",$D$9=\"Single Letter\"),INDEX('Current Board'!$B$2:$P$16,VLOOKUP(Scorekeeping!X133,'Standard Board Scores'!$R:$U,3,FALSE),VLOOKUP(Scorekeeping!X133,'Standard Board Scores'!$R:$U,4,FALSE)),\"\")),\"\")=0,\"\",IFERROR(IF(ISERROR(X133),\"\",IF(OR($D$9=\"Horizontal\",$D$9=\"Single Letter\"),INDEX('Current Board'!$B$2:$P$16,VLOOKUP(Scorekeeping!X133,'Standard Board Scores'!$R:$U,3,FALSE),VLOOKUP(Scorekeeping!X133,'Standard Board Scores'!$R:$U,4,FALSE)),\"\")),\"\")),\"\")","v":""},{"$f":"IF(X134<>\"\",IF(IFERROR(IF(Y133=\"\",\"\",IF(OR($D$9=\"Horizontal\",$D$9=\"Single Letter\"),INDEX('Current Board'!$B$2:$P$16,VLOOKUP(Scorekeeping!Y133,'Standard Board Scores'!$R:$U,3,FALSE),VLOOKUP(Scorekeeping!Y133,'Standard Board Scores'!$R:$U,4,FALSE)),\"\")),\"\")=0,\"\",IFERROR(IF(ISERROR(Y133),\"\",IF(OR($D$9=\"Horizontal\",$D$9=\"Single Letter\"),INDEX('Current Board'!$B$2:$P$16,VLOOKUP(Scorekeeping!Y133,'Standard Board Scores'!$R:$U,3,FALSE),VLOOKUP(Scorekeeping!Y133,'Standard Board Scores'!$R:$U,4,FALSE)),\"\")),\"\")),\"\")","v":""}]
[null,null,null,null,null,null,null,null,null,null,{"$f":"IFERROR(VLOOKUP(K134,'Tiles Remaining'!$A:$C,3,FALSE),\"\")","v":""},{"$f":"IFERROR(VLOOKUP(L134,'Tiles Remaining'!$A:$C,3,FALSE),\"\")","v":""},{"$f":"IFERROR(VLOOKUP(M134,'Tiles Remaining'!$A:$C,3,FALSE),\"\")","v":""},{"$f":"IFERROR(VLOOKUP(N134,'Tiles Remaining'!$A:$C,3,FALSE),\"\")","v":""},{"$f":"IFERROR(VLOOKUP(O134,'Tiles Remaining'!$A:$C,3,FALSE),\"\")","v":""},{"$f":"IFERROR(VLOOKUP(P134,'Tiles Remaining'!$A:$C,3,FALSE),\"\")","v":""},{"$f":"IFERROR(VLOOKUP(Q134,'Tiles Remaining'!$A:$C,3,FALSE),\"\")","v":""},{"$f":"IFERROR(VLOOKUP(R134,'Tiles Remaining'!$A:$C,3,FALSE),\"\")","v":""},{"$f":"IFERROR(VLOOKUP(S134,'Tiles Remaining'!$A:$C,3,FALSE),\"\")","v":""},{"$f":"IFERROR(VLOOKUP(T134,'Tiles Remaining'!$A:$C,3,FALSE),\"\")","v":""},{"$f":"IFERROR(VLOOKUP(U134,'Tiles Remaining'!$A:$C,3,FALSE),\"\")","v":""},{"$f":"IFERROR(VLOOKUP(V134,'Tiles Remaining'!$A:$C,3,FALSE),\"\")","v":""},{"$f":"IFERROR(VLOOKUP(W134,'Tiles Remaining'!$A:$C,3,FALSE),\"\")","v":""},{"$f":"IFERROR(VLOOKUP(X134,'Tiles Remaining'!$A:$C,3,FALSE),\"\")","v":""},{"$f":"IFERROR(VLOOKUP(Y134,'Tiles Remaining'!$A:$C,3,FALSE),\"\")","v":""},{"$f":"SUM(K135:Y135)","v":0}]
[null,null,null,null,null,null,null,null,null,null,null,"Horizontal 9 - Side B"]
[null,null,null,null,null,null,null,null,null,null,null,1,2,3,4,5,6,7,8,9,10,11,12,13,14]
[null,null,null,null,null,null,null,null,null,null,{"$f":"E28","v":""},{"$f":"IF(AND(K138<>\"\",REPLACE(K138,1,1,\"\")<>\"16\",REPLACE(K138,1,1,\"\")<>\"17\"),CONCATENATE(LEFT(K138),VALUE(REPLACE(K138,1,1,\"\"))+1),\"\")","v":""},{"$f":"IF(AND(L138<>\"\",REPLACE(L138,1,1,\"\")<>\"16\",REPLACE(L138,1,1,\"\")<>\"17\"),CONCATENATE(LEFT(L138),VALUE(REPLACE(L138,1,1,\"\"))+1),\"\")","v":""},"","","","","","","","","","","",""]
[null,null,null,null,null,null,null,null,null,null,{"$f":"IF(IFERROR(IF(K138=\"\",\"\",IF(OR($D$9=\"Horizontal\",$D$9=\"Single Letter\"),INDEX('Current Board'!$B$2:$P$16,VLOOKUP(Scorekeeping!K138,'Standard Board Scores'!$R:$U,3,FALSE),VLOOKUP(Scorekeeping!K138,'Standard Board Scores'!$R:$U,4,FALSE)),\"\")),\"\")=0,\"\",IFERROR(IF(ISERROR(K138),\"\",IF(OR($D$9=\"Horizontal\",$D$9=\"Single Letter\"),INDEX('Current Board'!$B$2:$P$16,VLOOKUP(Scorekeeping!K138,'Standard Board Scores'!$R:$U,3,FALSE),VLOOKUP(Scorekeeping!K138,'Standard Board Scores'!$R:$U,4,FALSE)),\"\")),\"\"))","v":""},{"$f":"IF(K139<>\"\",IF(IFERROR(IF(L138=\"\",\"\",IF(OR($D$9=\"Horizontal\",$D$9=\"Single Letter\"),INDEX('Current Board'!$B$2:$P$16,VLOOKUP(Scorekeeping!L138,'Standard Board Scores'!$R:$U,3,FALSE),VLOOKUP(Scorekeeping!L138,'Standard Board Scores'!$R:$U,4,FALSE)),\"\")),\"\")=0,\"\",IFERROR(IF(ISERROR(L138),\"\",IF(OR($D$9=\"Horizontal\",$D$9=\"Single Letter\"),INDEX('Current Board'!$B$2:$P$16,VLOOKUP(Scorekeeping!L138,'Standard Board Scores'!$R:$U,3,FALSE),VLOOKUP(Scorekeeping!L138,'Standard Board Scores'!$R:$U,4,FALSE)),\"\")),\"\")),\"\")","v":""},{"$f":"IF(L139<>\"\",IF(IFERROR(IF(M138=\"\",\"\",IF(OR($D$9=\"Horizontal\",$D$9=\"Single Letter\"),INDEX('Current Board'!$B$2:$P$16,VLOOKUP(Scorekeeping!M138,'Standard Board Scores'!$R:$U,3,FALSE),VLOOKUP(Scorekeeping!M138,'Standard Board Scores'!$R:$U,4,FALSE)),\"\")),\"\")=0,\"\",IFERROR(IF(ISERROR(M138),\"\",IF(OR($D$9=\"Horizontal\",$D$9=\"Single Letter\"),INDEX('Current Board'!$B$2:$P$16,VLOOKUP(Scorekeeping!M138,'Standard Board Scores'!$R:$U,3,FALSE),VLOOKUP(Scorekeeping!M138,'Standard Board Scores'!$R:$U,4,FALSE)),\"\")),\"\")),\"\")","v":""},{"$f":"IF(M139<>\"\",IF(IFERROR(IF(N138=\"\",\"\",IF(OR($D$9=\"Horizontal\",$D$9=\"Single Letter\"),INDEX('Current Board'!$B$2:$P$16,VLOOKUP(Scorekeeping!N138,'Standard Board Scores'!$R:$U,3,FALSE),VLOOKUP(Scorekeeping!N138,'Standard Board Scores'!$R:$U,4,FALSE)),\"\")),\"\")=0,\"\",IFERROR(IF(ISERROR(N138),\"\",IF(OR($D$9=\"Horizontal\",$D$9=\"Single Letter\"),INDEX('Current Board'!$B$2:$P$16,VLOOKUP(Scorekeeping!N138,'Standard Board Scores'!$R:$U,3,FALSE),VLOOKUP(Scorekeeping!N138,'Standard Board Scores'!$R:$U,4,FALSE)),\"\")),\"\")),\"\")","v":""},{"$f":"IF(N139<>\"\",IF(IFERROR(IF(O138=\"\",\"\",IF(OR($D$9=\"Horizontal\",$D$9=\"Single Letter\"),INDEX('Current Board'!$B$2:$P$16,VLOOKUP(Scorekeeping!O138,'Standard Board Scores'!$R:$U,3,FALSE),VLOOKUP(Scorekeeping!O138,'Standard Board Scores'!$R:$U,4,FALSE)),\"\")),\"\")=0,\"\",IFERROR(IF(ISERROR(O138),\"\",IF(OR($D$9=\"Horizontal\",$D$9=\"Single Letter\"),INDEX('Current Board'!$B$2:$P$16,VLOOKUP(Scorekeeping!O138,'Standard Board Scores'!$R:$U,3,FALSE),VLOOKUP(Scorekeeping!O138,'Standard Board Scores'!$R:$U,4,FALSE)),\"\")),\"\")),\"\")","v":""},{"$f":"IF(O139<>\"\",IF(IFERROR(IF(P138=\"\",\"\",IF(OR($D$9=\"Horizontal\",$D$9=\"Single Letter\"),INDEX('Current Board'!$B$2:$P$16,VLOOKUP(Scorekeeping!P138,'Standard Board Scores'!$R:$U,3,FALSE),VLOOKUP(Scorekeeping!P138,'Standard Board Scores'!$R:$U,4,FALSE)),\"\")),\"\")=0,\"\",IFERROR(IF(ISERROR(P138),\"\",IF(OR($D$9=\"Horizontal\",$D$9=\"Single Letter\"),INDEX('Current Board'!$B$2:$P$16,VLOOKUP(Scorekeeping!P138,'Standard Board Scores'!$R:$U,3,FALSE),VLOOKUP(Scorekeeping!P138,'Standard Board Scores'!$R:$U,4,FALSE)),\"\")),\"\")),\"\")","v":""},{"$f":"IF(P139<>\"\",IF(IFERROR(IF(Q138=\"\",\"\",IF(OR($D$9=\"Horizontal\",$D$9=\"Single Letter\"),INDEX('Current Board'!$B$2:$P$16,VLOOKUP(Scorekeeping!Q138,'Standard Board Scores'!$R:$U,3,FALSE),VLOOKUP(Scorekeeping!Q138,'Standard Board Scores'!$R:$U,4,FALSE)),\"\")),\"\")=0,\"\",IFERROR(IF(ISERROR(Q138),\"\",IF(OR($D$9=\"Horizontal\",$D$9=\"Single Letter\"),INDEX('Current Board'!$B$2:$P$16,VLOOKUP(Scorekeeping!Q138,'Standard Board Scores'!$R:$U,3,FALSE),VLOOKUP(Scorekeeping!Q138,'Standard Board Scores'!$R:$U,4,FALSE)),\"\")),\"\")),\"\")","v":""},{"$f":"IF(Q139<>\"\",IF(IFERROR(IF(R138=\"\",\"\",IF(OR($D$9=\"Horizontal\",$D$9=\"Single Letter\"),INDEX('Current Board'!$B$2:$P$16,VLOOKUP(Scorekeeping!R138,'Standard Board Scores'!$R:$U,3,FALSE),VLOOKUP(Scorekeeping!R138,'Standard Board Scores'!$R:$U,4,FALSE)),\"\")),\"\")=0,\"\",IFERROR(IF(ISERROR(R138),\"\",IF(OR($D$9=\"Horizontal\",$D$9=\"Single Letter\"),INDEX('Current Board'!$B$2:$P$16,VLOOKUP(Scorekeeping!R138,'Standard Board Scores'!$R:$U,3,FALSE),VLOOKUP(Scorekeeping!R138,'Standard Board Scores'!$R:$U,4,FALSE)),\"\")),\"\")),\"\")","v":""},{"$f":"IF(R139<>\"\",IF(IFERROR(IF(S138=\"\",\"\",IF(OR($D$9=\"Horizontal\",$D$9=\"Single Letter\"),INDEX('Current Board'!$B$2:$P$16,VLOOKUP(Scorekeeping!S138,'Standard Board Scores'!$R:$U,3,FALSE),VLOOKUP(Scorekeeping!S138,'Standard Board Scores'!$R:$U,4,FALSE)),\"\")),\"\")=0,\"\",IFERROR(IF(ISERROR(S138),\"\",IF(OR($D$9=\"Horizontal\",$D$9=\"Single Letter\"),INDEX('Current Board'!$B$2:$P$16,VLOOKUP(Scorekeeping!S138,'Standard Board Scores'!$R:$U,3,FALSE),VLOOKUP(Scorekeeping!S138,'Standard Board Scores'!$R:$U,4,FALSE)),\"\")),\"\")),\"\")","v":""},{"$f":"IF(S139<>\"\",IF(IFERROR(IF(T138=\"\",\"\",IF(OR($D$9=\"Horizontal\",$D$9=\"Single Letter\"),INDEX('Current Board'!$B$2:$P$16,VLOOKUP(Scorekeeping!T138,'Standard Board Scores'!$R:$U,3,FALSE),VLOOKUP(Scorekeeping!T138,'Standard Board Scores'!$R:$U,4,FALSE)),\"\")),\"\")=0,\"\",IFERROR(IF(ISERROR(T138),\"\",IF(OR($D$9=\"Horizontal\",$D$9=\"Single Letter\"),INDEX('Current Board'!$B$2:$P$16,VLOOKUP(Scorekeeping!T138,'Standard Board Scores'!$R:$U,3,FALSE),VLOOKUP(Scorekeeping!T138,'Standard Board Scores'!$R:$U,4,FALSE)),\"\")),\"\")),\"\")","v":""},{"$f":"IF(T139<>\"\",IF(IFERROR(IF(U138=\"\",\"\",IF(OR($D$9=\"Horizontal\",$D$9=\"Single Letter\"),INDEX('Current Board'!$B$2:$P$16,VLOOKUP(Scorekeeping!U138,'Standard Board Scores'!$R:$U,3,FALSE),VLOOKUP(Scorekeeping!U138,'Standard Board Scores'!$R:$U,4,FALSE)),\"\")),\"\")=0,\"\",IFERROR(IF(ISERROR(U138),\"\",IF(OR($D$9=\"Horizontal\",$D$9=\"Single Letter\"),INDEX('Current Board'!$B$2:$P$16,VLOOKUP(Scorekeeping!U138,'Standard Board Scores'!$R:$U,3,FALSE),VLOOKUP(Scorekeeping!U138,'Standard Board Scores'!$R:$U,4,FALSE)),\"\")),\"\")),\"\")","v":""},{"$f":"IF(U139<>\"\",IF(IFERROR(IF(V138=\"\",\"\",IF(OR($D$9=\"Horizontal\",$D$9=\"Single Letter\"),INDEX('Current Board'!$B$2:$P$16,VLOOKUP(Scorekeeping!V138,'Standard Board Scores'!$R:$U,3,FALSE),VLOOKUP(Scorekeeping!V138,'Standard Board Scores'!$R:$U,4,FALSE)),\"\")),\"\")=0,\"\",IFERROR(IF(ISERROR(V138),\"\",IF(OR($D$9=\"Horizontal\",$D$9=\"Single Letter\"),INDEX('Current Board'!$B$2:$P$16,VLOOKUP(Scorekeeping!V138,'Standard Board Scores'!$R:$U,3,FALSE),VLOOKUP(Scorekeeping!V138,'Standard Board Scores'!$R:$U,4,FALSE)),\"\")),\"\")),\"\")","v":""},{"$f":"IF(V139<>\"\",IF(IFERROR(IF(W138=\"\",\"\",IF(OR($D$9=\"Horizontal\",$D$9=\"Single Letter\"),INDEX('Current Board'!$B$2:$P$16,VLOOKUP(Scorekeeping!W138,'Standard Board Scores'!$R:$U,3,FALSE),VLOOKUP(Scorekeeping!W138,'Standard Board Scores'!$R:$U,4,FALSE)),\"\")),\"\")=0,\"\",IFERROR(IF(ISERROR(W138),\"\",IF(OR($D$9=\"Horizontal\",$D$9=\"Single Letter\"),INDEX('Current Board'!$B$2:$P$16,VLOOKUP(Scorekeeping!W138,'Standard Board Scores'!$R:$U,3,FALSE),VLOOKUP(Scorekeeping!W138,'Standard Board Scores'!$R:$U,4,FALSE)),\"\")),\"\")),\"\")","v":""},{"$f":"IF(W139<>\"\",IF(IFERROR(IF(X138=\"\",\"\",IF(OR($D$9=\"Horizontal\",$D$9=\"Single Letter\"),INDEX('Current Board'!$B$2:$P$16,VLOOKUP(Scorekeeping!X138,'Standard Board Scores'!$R:$U,3,FALSE),VLOOKUP(Scorekeeping!X138,'Standard Board Scores'!$R:$U,4,FALSE)),\"\")),\"\")=0,\"\",IFERROR(IF(ISERROR(X138),\"\",IF(OR($D$9=\"Horizontal\",$D$9=\"Single Letter\"),INDEX('Current Board'!$B$2:$P$16,VLOOKUP(Scorekeeping!X138,'Standard Board Scores'!$R:$U,3,FALSE),VLOOKUP(Scorekeeping!X138,'Standard Board Scores'!$R:$U,4,FALSE)),\"\")),\"\")),\"\")","v":""},{"$f":"IF(X139<>\"\",IF(IFERROR(IF(Y138=\"\",\"\",IF(OR($D$9=\"Horizontal\",$D$9=\"Single Letter\"),INDEX('Current Board'!$B$2:$P$16,VLOOKUP(Scorekeeping!Y138,'Standard Board Scores'!$R:$U,3,FALSE),VLOOKUP(Scorekeeping!Y138,'Standard Board Scores'!$R:$U,4,FALSE)),\"\")),\"\")=0,\"\",IFERROR(IF(ISERROR(Y138),\"\",IF(OR($D$9=\"Horizontal\",$D$9=\"Single Letter\"),INDEX('Current Board'!$B$2:$P$16,VLOOKUP(Scorekeeping!Y138,'Standard Board Scores'!$R:$U,3,FALSE),VLOOKUP(Scorekeeping!Y138,'Standard Board Scores'!$R:$U,4,FALSE)),\"\")),\"\")),\"\")","v":""}]
[null,null,null,null,null,null,null,null,null,null,{"$f":"IFERROR(VLOOKUP(K139,'Tiles Remaining'!$A:$C,3,FALSE),\"\")","v":""},{"$f":"IFERROR(VLOOKUP(L139,'Tiles Remaining'!$A:$C,3,FALSE),\"\")","v":""},{"$f":"IFERROR(VLOOKUP(M139,'Tiles Remaining'!$A:$C,3,FALSE),\"\")","v":""},{"$f":"IFERROR(VLOOKUP(N139,'Tiles Remaining'!$A:$C,3,FALSE),\"\")","v":""},{"$f":"IFERROR(VLOOKUP(O139,'Tiles Remaining'!$A:$C,3,FALSE),\"\")","v":""},{"$f":"IFERROR(VLOOKUP(P139,'Tiles Remaining'!$A:$C,3,FALSE),\"\")","v":""},{"$f":"IFERROR(VLOOKUP(Q139,'Tiles Remaining'!$A:$C,3,FALSE),\"\")","v":""},{"$f":"IFERROR(VLOOKUP(R139,'Tiles Remaining'!$A:$C,3,FALSE),\"\")","v":""},{"$f":"IFERROR(VLOOKUP(S139,'Tiles Remaining'!$A:$C,3,FALSE),\"\")","v":""},{"$f":"IFERROR(VLOOKUP(T139,'Tiles Remaining'!$A:$C,3,FALSE),\"\")","v":""},{"$f":"IFERROR(VLOOKUP(U139,'Tiles Remaining'!$A:$C,3,FALSE),\"\")","v":""},{"$f":"IFERROR(VLOOKUP(V139,'Tiles Remaining'!$A:$C,3,FALSE),\"\")","v":""},{"$f":"IFERROR(VLOOKUP(W139,'Tiles Remaining'!$A:$C,3,FALSE),\"\")","v":""},{"$f":"IFERROR(VLOOKUP(X139,'Tiles Remaining'!$A:$C,3,FALSE),\"\")","v":""},{"$f":"IFERROR(VLOOKUP(Y139,'Tiles Remaining'!$A:$C,3,FALSE),\"\")","v":""},{"$f":"SUM(K140:Y140)","v":0}]
[null,null,null,null,null,null,null,null,null,null,null,"Horizontal 10 - Side B"]
[null,null,null,null,null,null,null,null,null,null,null,1,2,3,4,5,6,7,8,9,10,11,12,13,14]
[null,null,null,null,null,null,null,null,null,null,{"$f":"F28","v":""},{"$f":"IF(AND(K143<>\"\",REPLACE(K143,1,1,\"\")<>\"16\",REPLACE(K143,1,1,\"\")<>\"17\"),CONCATENATE(LEFT(K143),VALUE(REPLACE(K143,1,1,\"\"))+1),\"\")","v":""},{"$f":"IF(AND(L143<>\"\",REPLACE(L143,1,1,\"\")<>\"16\",REPLACE(L143,1,1,\"\")<>\"17\"),CONCATENATE(LEFT(L143),VALUE(REPLACE(L143,1,1,\"\"))+1),\"\")","v":""},"","","","","","","","","","","",""]
[null,null,null,null,null,null,null,null,null,null,{"$f":"IF(IFERROR(IF(K143=\"\",\"\",IF(OR($D$9=\"Horizontal\",$D$9=\"Single Letter\"),INDEX('Current Board'!$B$2:$P$16,VLOOKUP(Scorekeeping!K143,'Standard Board Scores'!$R:$U,3,FALSE),VLOOKUP(Scorekeeping!K143,'Standard Board Scores'!$R:$U,4,FALSE)),\"\")),\"\")=0,\"\",IFERROR(IF(ISERROR(K143),\"\",IF(OR($D$9=\"Horizontal\",$D$9=\"Single Letter\"),INDEX('Current Board'!$B$2:$P$16,VLOOKUP(Scorekeeping!K143,'Standard Board Scores'!$R:$U,3,FALSE),VLOOKUP(Scorekeeping!K143,'Standard Board Scores'!$R:$U,4,FALSE)),\"\")),\"\"))","v":""},{"$f":"IF(K144<>\"\",IF(IFERROR(IF(L143=\"\",\"\",IF(OR($D$9=\"Horizontal\",$D$9=\"Single Letter\"),INDEX('Current Board'!$B$2:$P$16,VLOOKUP(Scorekeeping!L143,'Standard Board Scores'!$R:$U,3,FALSE),VLOOKUP(Scorekeeping!L143,'Standard Board Scores'!$R:$U,4,FALSE)),\"\")),\"\")=0,\"\",IFERROR(IF(ISERROR(L143),\"\",IF(OR($D$9=\"Horizontal\",$D$9=\"Single Letter\"),INDEX('Current Board'!$B$2:$P$16,VLOOKUP(Scorekeeping!L143,'Standard Board Scores'!$R:$U,3,FALSE),VLOOKUP(Scorekeeping!L143,'Standard Board Scores'!$R:$U,4,FALSE)),\"\")),\"\")),\"\")","v":""},{"$f":"IF(L144<>\"\",IF(IFERROR(IF(M143=\"\",\"\",IF(OR($D$9=\"Horizontal\",$D$9=\"Single Letter\"),INDEX('Current Board'!$B$2:$P$16,VLOOKUP(Scorekeeping!M143,'Standard Board Scores'!$R:$U,3,FALSE),VLOOKUP(Scorekeeping!M143,'Standard Board Scores'!$R:$U,4,FALSE)),\"\")),\"\")=0,\"\",IFERROR(IF(ISERROR(M143),\"\",IF(OR($D$9=\"Horizontal\",$D$9=\"Single Letter\"),INDEX('Current Board'!$B$2:$P$16,VLOOKUP(Scorekeeping!M143,'Standard Board Scores'!$R:$U,3,FALSE),VLOOKUP(Scorekeeping!M143,'Standard Board Scores'!$R:$U,4,FALSE)),\"\")),\"\")),\"\")","v":""},{"$f":"IF(M144<>\"\",IF(IFERROR(IF(N143=\"\",\"\",IF(OR($D$9=\"Horizontal\",$D$9=\"Single Letter\"),INDEX('Current Board'!$B$2:$P$16,VLOOKUP(Scorekeeping!N143,'Standard Board Scores'!$R:$U,3,FALSE),VLOOKUP(Scorekeeping!N143,'Standard Board Scores'!$R:$U,4,FALSE)),\"\")),\"\")=0,\"\",IFERROR(IF(ISERROR(N143),\"\",IF(OR($D$9=\"Horizontal\",$D$9=\"Single Letter\"),INDEX('Current Board'!$B$2:$P$16,VLOOKUP(Scorekeeping!N143,'Standard Board Scores'!$R:$U,3,FALSE),VLOOKUP(Scorekeeping!N143,'Standard Board Scores'!$R:$U,4,FALSE)),\"\")),\"\")),\"\")","v":""},{"$f":"IF(N144<>\"\",IF(IFERROR(IF(O143=\"\",\"\",IF(OR($D$9=\"Horizontal\",$D$9=\"Single Letter\"),INDEX('Current Board'!$B$2:$P$16,VLOOKUP(Scorekeeping!O143,'Standard Board Scores'!$R:$U,3,FALSE),VLOOKUP(Scorekeeping!O143,'Standard Board Scores'!$R:$U,4,FALSE)),\"\")),\"\")=0,\"\",IFERROR(IF(ISERROR(O143),\"\",IF(OR($D$9=\"Horizontal\",$D$9=\"Single Letter\"),INDEX('Current Board'!$B$2:$P$16,VLOOKUP(Scorekeeping!O143,'Standard Board Scores'!$R:$U,3,FALSE),VLOOKUP(Scorekeeping!O143,'Standard Board Scores'!$R:$U,4,FALSE)),\"\")),\"\")),\"\")","v":""},{"$f":"IF(O144<>\"\",IF(IFERROR(IF(P143=\"\",\"\",IF(OR($D$9=\"Horizontal\",$D$9=\"Single Letter\"),INDEX('Current Board'!$B$2:$P$16,VLOOKUP(Scorekeeping!P143,'Standard Board Scores'!$R:$U,3,FALSE),VLOOKUP(Scorekeeping!P143,'Standard Board Scores'!$R:$U,4,FALSE)),\"\")),\"\")=0,\"\",IFERROR(IF(ISERROR(P143),\"\",IF(OR($D$9=\"Horizontal\",$D$9=\"Single Letter\"),INDEX('Current Board'!$B$2:$P$16,VLOOKUP(Scorekeeping!P143,'Standard Board Scores'!$R:$U,3,FALSE),VLOOKUP(Scorekeeping!P143,'Standard Board Scores'!$R:$U,4,FALSE)),\"\")),\"\")),\"\")","v":""},{"$f":"IF(P144<>\"\",IF(IFERROR(IF(Q143=\"\",\"\",IF(OR($D$9=\"Horizontal\",$D$9=\"Single Letter\"),INDEX('Current Board'!$B$2:$P$16,VLOOKUP(Scorekeeping!Q143,'Standard Board Scores'!$R:$U,3,FALSE),VLOOKUP(Scorekeeping!Q143,'Standard Board Scores'!$R:$U,4,FALSE)),\"\")),\"\")=0,\"\",IFERROR(IF(ISERROR(Q143),\"\",IF(OR($D$9=\"Horizontal\",$D$9=\"Single Letter\"),INDEX('Current Board'!$B$2:$P$16,VLOOKUP(Scorekeeping!Q143,'Standard Board Scores'!$R:$U,3,FALSE),VLOOKUP(Scorekeeping!Q143,'Standard Board Scores'!$R:$U,4,FALSE)),\"\")),\"\")),\"\")","v":""},{"$f":"IF(Q144<>\"\",IF(IFERROR(IF(R143=\"\",\"\",IF(OR($D$9=\"Horizontal\",$D$9=\"Single Letter\"),INDEX('Current Board'!$B$2:$P$16,VLOOKUP(Scorekeeping!R143,'Standard Board Scores'!$R:$U,3,FALSE),VLOOKUP(Scorekeeping!R143,'Standard Board Scores'!$R:$U,4,FALSE)),\"\")),\"\")=0,\"\",IFERROR(IF(ISERROR(R143),\"\",IF(OR($D$9=\"Horizontal\",$D$9=\"Single Letter\"),INDEX('Current Board'!$B$2:$P$16,VLOOKUP(Scorekeeping!R143,'Standard Board Scores'!$R:$U,3,FALSE),VLOOKUP(Scorekeeping!R143,'Standard Board Scores'!$R:$U,4,FALSE)),\"\")),\"\")),\"\")","v":""},{"$f":"IF(R144<>\"\",IF(IFERROR(IF(S143=\"\",\"\",IF(OR($D$9=\"Horizontal\",$D$9=\"Single Letter\"),INDEX('Current Board'!$B$2:$P$16,VLOOKUP(Scorekeeping!S143,'Standard Board Scores'!$R:$U,3,FALSE),VLOOKUP(Scorekeeping!S143,'Standard Board Scores'!$R:$U,4,FALSE)),\"\")),\"\")=0,\"\",IFERROR(IF(ISERROR(S143),\"\",IF(OR($D$9=\"Horizontal\",$D$9=\"Single Letter\"),INDEX('Current Board'!$B$2:$P$16,VLOOKUP(Scorekeeping!S143,'Standard Board Scores'!$R:$U,3,FALSE),VLOOKUP(Scorekeeping!S143,'Standard Board Scores'!$R:$U,4,FALSE)),\"\")),\"\")),\"\")","v":""},{"$f":"IF(S144<>\"\",IF(IFERROR(IF(T143=\"\",\"\",IF(OR($D$9=\"Horizontal\",$D$9=\"Single Letter\"),INDEX('Current Board'!$B$2:$P$16,VLOOKUP(Scorekeeping!T143,'Standard Board Scores'!$R:$U,3,FALSE),VLOOKUP(Scorekeeping!T143,'Standard Board Scores'!$R:$U,4,FALSE)),\"\")),\"\")=0,\"\",IFERROR(IF(ISERROR(T143),\"\",IF(OR($D$9=\"Horizontal\",$D$9=\"Single Letter\"),INDEX('Current Board'!$B$2:$P$16,VLOOKUP(Scorekeeping!T143,'Standard Board Scores'!$R:$U,3,FALSE),VLOOKUP(Scorekeeping!T143,'Standard Board Scores'!$R:$U,4,FALSE)),\"\")),\"\")),\"\")","v":""},{"$f":"IF(T144<>\"\",IF(IFERROR(IF(U143=\"\",\"\",IF(OR($D$9=\"Horizontal\",$D$9=\"Single Letter\"),INDEX('Current Board'!$B$2:$P$16,VLOOKUP(Scorekeeping!U143,'Standard Board Scores'!$R:$U,3,FALSE),VLOOKUP(Scorekeeping!U143,'Standard Board Scores'!$R:$U,4,FALSE)),\"\")),\"\")=0,\"\",IFERROR(IF(ISERROR(U143),\"\",IF(OR($D$9=\"Horizontal\",$D$9=\"Single Letter\"),INDEX('Current Board'!$B$2:$P$16,VLOOKUP(Scorekeeping!U143,'Standard Board Scores'!$R:$U,3,FALSE),VLOOKUP(Scorekeeping!U143,'Standard Board Scores'!$R:$U,4,FALSE)),\"\")),\"\")),\"\")","v":""},{"$f":"IF(U144<>\"\",IF(IFERROR(IF(V143=\"\",\"\",IF(OR($D$9=\"Horizontal\",$D$9=\"Single Letter\"),INDEX('Current Board'!$B$2:$P$16,VLOOKUP(Scorekeeping!V143,'Standard Board Scores'!$R:$U,3,FALSE),VLOOKUP(Scorekeeping!V143,'Standard Board Scores'!$R:$U,4,FALSE)),\"\")),\"\")=0,\"\",IFERROR(IF(ISERROR(V143),\"\",IF(OR($D$9=\"Horizontal\",$D$9=\"Single Letter\"),INDEX('Current Board'!$B$2:$P$16,VLOOKUP(Scorekeeping!V143,'Standard Board Scores'!$R:$U,3,FALSE),VLOOKUP(Scorekeeping!V143,'Standard Board Scores'!$R:$U,4,FALSE)),\"\")),\"\")),\"\")","v":""},{"$f":"IF(V144<>\"\",IF(IFERROR(IF(W143=\"\",\"\",IF(OR($D$9=\"Horizontal\",$D$9=\"Single Letter\"),INDEX('Current Board'!$B$2:$P$16,VLOOKUP(Scorekeeping!W143,'Standard Board Scores'!$R:$U,3,FALSE),VLOOKUP(Scorekeeping!W143,'Standard Board Scores'!$R:$U,4,FALSE)),\"\")),\"\")=0,\"\",IFERROR(IF(ISERROR(W143),\"\",IF(OR($D$9=\"Horizontal\",$D$9=\"Single Letter\"),INDEX('Current Board'!$B$2:$P$16,VLOOKUP(Scorekeeping!W143,'Standard Board Scores'!$R:$U,3,FALSE),VLOOKUP(Scorekeeping!W143,'Standard Board Scores'!$R:$U,4,FALSE)),\"\")),\"\")),\"\")","v":""},{"$f":"IF(W144<>\"\",IF(IFERROR(IF(X143=\"\",\"\",IF(OR($D$9=\"Horizontal\",$D$9=\"Single Letter\"),INDEX('Current Board'!$B$2:$P$16,VLOOKUP(Scorekeeping!X143,'Standard Board Scores'!$R:$U,3,FALSE),VLOOKUP(Scorekeeping!X143,'Standard Board Scores'!$R:$U,4,FALSE)),\"\")),\"\")=0,\"\",IFERROR(IF(ISERROR(X143),\"\",IF(OR($D$9=\"Horizontal\",$D$9=\"Single Letter\"),INDEX('Current Board'!$B$2:$P$16,VLOOKUP(Scorekeeping!X143,'Standard Board Scores'!$R:$U,3,FALSE),VLOOKUP(Scorekeeping!X143,'Standard Board Scores'!$R:$U,4,FALSE)),\"\")),\"\")),\"\")","v":""},{"$f":"IF(X144<>\"\",IF(IFERROR(IF(Y143=\"\",\"\",IF(OR($D$9=\"Horizontal\",$D$9=\"Single Letter\"),INDEX('Current Board'!$B$2:$P$16,VLOOKUP(Scorekeeping!Y143,'Standard Board Scores'!$R:$U,3,FALSE),VLOOKUP(Scorekeeping!Y143,'Standard Board Scores'!$R:$U,4,FALSE)),\"\")),\"\")=0,\"\",IFERROR(IF(ISERROR(Y143),\"\",IF(OR($D$9=\"Horizontal\",$D$9=\"Single Letter\"),INDEX('Current Board'!$B$2:$P$16,VLOOKUP(Scorekeeping!Y143,'Standard Board Scores'!$R:$U,3,FALSE),VLOOKUP(Scorekeeping!Y143,'Standard Board Scores'!$R:$U,4,FALSE)),\"\")),\"\")),\"\")","v":""}]
[null,null,null,null,null,null,null,null,null,null,{"$f":"IFERROR(VLOOKUP(K144,'Tiles Remaining'!$A:$C,3,FALSE),\"\")","v":""},{"$f":"IFERROR(VLOOKUP(L144,'Tiles Remaining'!$A:$C,3,FALSE),\"\")","v":""},{"$f":"IFERROR(VLOOKUP(M144,'Tiles Remaining'!$A:$C,3,FALSE),\"\")","v":""},{"$f":"IFERROR(VLOOKUP(N144,'Tiles Remaining'!$A:$C,3,FALSE),\"\")","v":""},{"$f":"IFERROR(VLOOKUP(O144,'Tiles Remaining'!$A:$C,3,FALSE),\"\")","v":""},{"$f":"IFERROR(VLOOKUP(P144,'Tiles Remaining'!$A:$C,3,FALSE),\"\")","v":""},{"$f":"IFERROR(VLOOKUP(Q144,'Tiles Remaining'!$A:$C,3,FALSE),\"\")","v":""},{"$f":"IFERROR(VLOOKUP(R144,'Tiles Remaining'!$A:$C,3,FALSE),\"\")","v":""},{"$f":"IFERROR(VLOOKUP(S144,'Tiles Remaining'!$A:$C,3,FALSE),\"\")","v":""},{"$f":"IFERROR(VLOOKUP(T144,'Tiles Remaining'!$A:$C,3,FALSE),\"\")","v":""},{"$f":"IFERROR(VLOOKUP(U144,'Tiles Remaining'!$A:$C,3,FALSE),\"\")","v":""},{"$f":"IFERROR(VLOOKUP(V144,'Tiles Remaining'!$A:$C,3,FALSE),\"\")","v":""},{"$f":"IFERROR(VLOOKUP(W144,'Tiles Remaining'!$A:$C,3,FALSE),\"\")","v":""},{"$f":"IFERROR(VLOOKUP(X144,'Tiles Remaining'!$A:$C,3,FALSE),\"\")","v":""},{"$f":"IFERROR(VLOOKUP(Y144,'Tiles Remaining'!$A:$C,3,FALSE),\"\")","v":""},{"$f":"SUM(K145:Y145)","v":0}]
[null,null,null,null,null,null,null,null,null,null,null,"Horizontal 11 - Side B"]
[null,null,null,null,null,null,null,null,null,null,null,1,2,3,4,5,6,7,8,9,10,11,12,13,14]
[null,null,null,null,null,null,null,null,null,null,{"$f":"G28","v":""},{"$f":"IF(AND(K148<>\"\",REPLACE(K148,1,1,\"\")<>\"16\",REPLACE(K148,1,1,\"\")<>\"17\"),CONCATENATE(LEFT(K148),VALUE(REPLACE(K148,1,1,\"\"))+1),\"\")","v":""},{"$f":"IF(AND(L148<>\"\",REPLACE(L148,1,1,\"\")<>\"16\",REPLACE(L148,1,1,\"\")<>\"17\"),CONCATENATE(LEFT(L148),VALUE(REPLACE(L148,1,1,\"\"))+1),\"\")","v":""},"","","","","","","","","","","",""]
[null,null,null,null,null,null,null,null,null,null,{"$f":"IF(IFERROR(IF(K148=\"\",\"\",IF(OR($D$9=\"Horizontal\",$D$9=\"Single Letter\"),INDEX('Current Board'!$B$2:$P$16,VLOOKUP(Scorekeeping!K148,'Standard Board Scores'!$R:$U,3,FALSE),VLOOKUP(Scorekeeping!K148,'Standard Board Scores'!$R:$U,4,FALSE)),\"\")),\"\")=0,\"\",IFERROR(IF(ISERROR(K148),\"\",IF(OR($D$9=\"Horizontal\",$D$9=\"Single Letter\"),INDEX('Current Board'!$B$2:$P$16,VLOOKUP(Scorekeeping!K148,'Standard Board Scores'!$R:$U,3,FALSE),VLOOKUP(Scorekeeping!K148,'Standard Board Scores'!$R:$U,4,FALSE)),\"\")),\"\"))","v":""},{"$f":"IF(K149<>\"\",IF(IFERROR(IF(L148=\"\",\"\",IF(OR($D$9=\"Horizontal\",$D$9=\"Single Letter\"),INDEX('Current Board'!$B$2:$P$16,VLOOKUP(Scorekeeping!L148,'Standard Board Scores'!$R:$U,3,FALSE),VLOOKUP(Scorekeeping!L148,'Standard Board Scores'!$R:$U,4,FALSE)),\"\")),\"\")=0,\"\",IFERROR(IF(ISERROR(L148),\"\",IF(OR($D$9=\"Horizontal\",$D$9=\"Single Letter\"),INDEX('Current Board'!$B$2:$P$16,VLOOKUP(Scorekeeping!L148,'Standard Board Scores'!$R:$U,3,FALSE),VLOOKUP(Scorekeeping!L148,'Standard Board Scores'!$R:$U,4,FALSE)),\"\")),\"\")),\"\")","v":""},{"$f":"IF(L149<>\"\",IF(IFERROR(IF(M148=\"\",\"\",IF(OR($D$9=\"Horizontal\",$D$9=\"Single Letter\"),INDEX('Current Board'!$B$2:$P$16,VLOOKUP(Scorekeeping!M148,'Standard Board Scores'!$R:$U,3,FALSE),VLOOKUP(Scorekeeping!M148,'Standard Board Scores'!$R:$U,4,FALSE)),\"\")),\"\")=0,\"\",IFERROR(IF(ISERROR(M148),\"\",IF(OR($D$9=\"Horizontal\",$D$9=\"Single Letter\"),INDEX('Current Board'!$B$2:$P$16,VLOOKUP(Scorekeeping!M148,'Standard Board Scores'!$R:$U,3,FALSE),VLOOKUP(Scorekeeping!M148,'Standard Board Scores'!$R:$U,4,FALSE)),\"\")),\"\")),\"\")","v":""},{"$f":"IF(M149<>\"\",IF(IFERROR(IF(N148=\"\",\"\",IF(OR($D$9=\"Horizontal\",$D$9=\"Single Letter\"),INDEX('Current Board'!$B$2:$P$16,VLOOKUP(Scorekeeping!N148,'Standard Board Scores'!$R:$U,3,FALSE),VLOOKUP(Scorekeeping!N148,'Standard Board Scores'!$R:$U,4,FALSE)),\"\")),\"\")=0,\"\",IFERROR(IF(ISERROR(N148),\"\",IF(OR($D$9=\"Horizontal\",$D$9=\"Single Letter\"),INDEX('Current Board'!$B$2:$P$16,VLOOKUP(Scorekeeping!N148,'Standard Board Scores'!$R:$U,3,FALSE),VLOOKUP(Scorekeeping!N148,'Standard Board Scores'!$R:$U,4,FALSE)),\"\")),\"\")),\"\")","v":""},{"$f":"IF(N149<>\"\",IF(IFERROR(IF(O148=\"\",\"\",IF(OR($D$9=\"Horizontal\",$D$9=\"Single Letter\"),INDEX('Current Board'!$B$2:$P$16,VLOOKUP(Scorekeeping!O148,'Standard Board Scores'!$R:$U,3,FALSE),VLOOKUP(Scorekeeping!O148,'Standard Board Scores'!$R:$U,4,FALSE)),\"\")),\"\")=0,\"\",IFERROR(IF(ISERROR(O148),\"\",IF(OR($D$9=\"Horizontal\",$D$9=\"Single Letter\"),INDEX('Current Board'!$B$2:$P$16,VLOOKUP(Scorekeeping!O148,'Standard Board Scores'!$R:$U,3,FALSE),VLOOKUP(Scorekeeping!O148,'Standard Board Scores'!$R:$U,4,FALSE)),\"\")),\"\")),\"\")","v":""},{"$f":"IF(O149<>\"\",IF(IFERROR(IF(P148=\"\",\"\",IF(OR($D$9=\"Horizontal\",$D$9=\"Single Letter\"),INDEX('Current Board'!$B$2:$P$16,VLOOKUP(Scorekeeping!P148,'Standard Board Scores'!$R:$U,3,FALSE),VLOOKUP(Scorekeeping!P148,'Standard Board Scores'!$R:$U,4,FALSE)),\"\")),\"\")=0,\"\",IFERROR(IF(ISERROR(P148),\"\",IF(OR($D$9=\"Horizontal\",$D$9=\"Single Letter\"),INDEX('Current Board'!$B$2:$P$16,VLOOKUP(Scorekeeping!P148,'Standard Board Scores'!$R:$U,3,FALSE),VLOOKUP(Scorekeeping!P148,'Standard Board Scores'!$R:$U,4,FALSE)),\"\")),\"\")),\"\")","v":""},{"$f":"IF(P149<>\"\",IF(IFERROR(IF(Q148=\"\",\"\",IF(OR($D$9=\"Horizontal\",$D$9=\"Single Letter\"),INDEX('Current Board'!$B$2:$P$16,VLOOKUP(Scorekeeping!Q148,'Standard Board Scores'!$R:$U,3,FALSE),VLOOKUP(Scorekeeping!Q148,'Standard Board Scores'!$R:$U,4,FALSE)),\"\")),\"\")=0,\"\",IFERROR(IF(ISERROR(Q148),\"\",IF(OR($D$9=\"Horizontal\",$D$9=\"Single Letter\"),INDEX('Current Board'!$B$2:$P$16,VLOOKUP(Scorekeeping!Q148,'Standard Board Scores'!$R:$U,3,FALSE),VLOOKUP(Scorekeeping!Q148,'Standard Board Scores'!$R:$U,4,FALSE)),\"\")),\"\")),\"\")","v":""},{"$f":"IF(Q149<>\"\",IF(IFERROR(IF(R148=\"\",\"\",IF(OR($D$9=\"Horizontal\",$D$9=\"Single Letter\"),INDEX('Current Board'!$B$2:$P$16,VLOOKUP(Scorekeeping!R148,'Standard Board Scores'!$R:$U,3,FALSE),VLOOKUP(Scorekeeping!R148,'Standard Board Scores'!$R:$U,4,FALSE)),\"\")),\"\")=0,\"\",IFERROR(IF(ISERROR(R148),\"\",IF(OR($D$9=\"Horizontal\",$D$9=\"Single Letter\"),INDEX('Current Board'!$B$2:$P$16,VLOOKUP(Scorekeeping!R148,'Standard Board Scores'!$R:$U,3,FALSE),VLOOKUP(Scorekeeping!R148,'Standard Board Scores'!$R:$U,4,FALSE)),\"\")),\"\")),\"\")","v":""},{"$f":"IF(R149<>\"\",IF(IFERROR(IF(S148=\"\",\"\",IF(OR($D$9=\"Horizontal\",$D$9=\"Single Letter\"),INDEX('Current Board'!$B$2:$P$16,VLOOKUP(Scorekeeping!S148,'Standard Board Scores'!$R:$U,3,FALSE),VLOOKUP(Scorekeeping!S148,'Standard Board Scores'!$R:$U,4,FALSE)),\"\")),\"\")=0,\"\",IFERROR(IF(ISERROR(S148),\"\",IF(OR($D$9=\"Horizontal\",$D$9=\"Single Letter\"),INDEX('Current Board'!$B$2:$P$16,VLOOKUP(Scorekeeping!S148,'Standard Board Scores'!$R:$U,3,FALSE),VLOOKUP(Scorekeeping!S148,'Standard Board Scores'!$R:$U,4,FALSE)),\"\")),\"\")),\"\")","v":""},{"$f":"IF(S149<>\"\",IF(IFERROR(IF(T148=\"\",\"\",IF(OR($D$9=\"Horizontal\",$D$9=\"Single Letter\"),INDEX('Current Board'!$B$2:$P$16,VLOOKUP(Scorekeeping!T148,'Standard Board Scores'!$R:$U,3,FALSE),VLOOKUP(Scorekeeping!T148,'Standard Board Scores'!$R:$U,4,FALSE)),\"\")),\"\")=0,\"\",IFERROR(IF(ISERROR(T148),\"\",IF(OR($D$9=\"Horizontal\",$D$9=\"Single Letter\"),INDEX('Current Board'!$B$2:$P$16,VLOOKUP(Scorekeeping!T148,'Standard Board Scores'!$R:$U,3,FALSE),VLOOKUP(Scorekeeping!T148,'Standard Board Scores'!$R:$U,4,FALSE)),\"\")),\"\")),\"\")","v":""},{"$f":"IF(T149<>\"\",IF(IFERROR(IF(U148=\"\",\"\",IF(OR($D$9=\"Horizontal\",$D$9=\"Single Letter\"),INDEX('Current Board'!$B$2:$P$16,VLOOKUP(Scorekeeping!U148,'Standard Board Scores'!$R:$U,3,FALSE),VLOOKUP(Scorekeeping!U148,'Standard Board Scores'!$R:$U,4,FALSE)),\"\")),\"\")=0,\"\",IFERROR(IF(ISERROR(U148),\"\",IF(OR($D$9=\"Horizontal\",$D$9=\"Single Letter\"),INDEX('Current Board'!$B$2:$P$16,VLOOKUP(Scorekeeping!U148,'Standard Board Scores'!$R:$U,3,FALSE),VLOOKUP(Scorekeeping!U148,'Standard Board Scores'!$R:$U,4,FALSE)),\"\")),\"\")),\"\")","v":""},{"$f":"IF(U149<>\"\",IF(IFERROR(IF(V148=\"\",\"\",IF(OR($D$9=\"Horizontal\",$D$9=\"Single Letter\"),INDEX('Current Board'!$B$2:$P$16,VLOOKUP(Scorekeeping!V148,'Standard Board Scores'!$R:$U,3,FALSE),VLOOKUP(Scorekeeping!V148,'Standard Board Scores'!$R:$U,4,FALSE)),\"\")),\"\")=0,\"\",IFERROR(IF(ISERROR(V148),\"\",IF(OR($D$9=\"Horizontal\",$D$9=\"Single Letter\"),INDEX('Current Board'!$B$2:$P$16,VLOOKUP(Scorekeeping!V148,'Standard Board Scores'!$R:$U,3,FALSE),VLOOKUP(Scorekeeping!V148,'Standard Board Scores'!$R:$U,4,FALSE)),\"\")),\"\")),\"\")","v":""},{"$f":"IF(V149<>\"\",IF(IFERROR(IF(W148=\"\",\"\",IF(OR($D$9=\"Horizontal\",$D$9=\"Single Letter\"),INDEX('Current Board'!$B$2:$P$16,VLOOKUP(Scorekeeping!W148,'Standard Board Scores'!$R:$U,3,FALSE),VLOOKUP(Scorekeeping!W148,'Standard Board Scores'!$R:$U,4,FALSE)),\"\")),\"\")=0,\"\",IFERROR(IF(ISERROR(W148),\"\",IF(OR($D$9=\"Horizontal\",$D$9=\"Single Letter\"),INDEX('Current Board'!$B$2:$P$16,VLOOKUP(Scorekeeping!W148,'Standard Board Scores'!$R:$U,3,FALSE),VLOOKUP(Scorekeeping!W148,'Standard Board Scores'!$R:$U,4,FALSE)),\"\")),\"\")),\"\")","v":""},{"$f":"IF(W149<>\"\",IF(IFERROR(IF(X148=\"\",\"\",IF(OR($D$9=\"Horizontal\",$D$9=\"Single Letter\"),INDEX('Current Board'!$B$2:$P$16,VLOOKUP(Scorekeeping!X148,'Standard Board Scores'!$R:$U,3,FALSE),VLOOKUP(Scorekeeping!X148,'Standard Board Scores'!$R:$U,4,FALSE)),\"\")),\"\")=0,\"\",IFERROR(IF(ISERROR(X148),\"\",IF(OR($D$9=\"Horizontal\",$D$9=\"Single Letter\"),INDEX('Current Board'!$B$2:$P$16,VLOOKUP(Scorekeeping!X148,'Standard Board Scores'!$R:$U,3,FALSE),VLOOKUP(Scorekeeping!X148,'Standard Board Scores'!$R:$U,4,FALSE)),\"\")),\"\")),\"\")","v":""},{"$f":"IF(X149<>\"\",IF(IFERROR(IF(Y148=\"\",\"\",IF(OR($D$9=\"Horizontal\",$D$9=\"Single Letter\"),INDEX('Current Board'!$B$2:$P$16,VLOOKUP(Scorekeeping!Y148,'Standard Board Scores'!$R:$U,3,FALSE),VLOOKUP(Scorekeeping!Y148,'Standard Board Scores'!$R:$U,4,FALSE)),\"\")),\"\")=0,\"\",IFERROR(IF(ISERROR(Y148),\"\",IF(OR($D$9=\"Horizontal\",$D$9=\"Single Letter\"),INDEX('Current Board'!$B$2:$P$16,VLOOKUP(Scorekeeping!Y148,'Standard Board Scores'!$R:$U,3,FALSE),VLOOKUP(Scorekeeping!Y148,'Standard Board Scores'!$R:$U,4,FALSE)),\"\")),\"\")),\"\")","v":""}]
[null,null,null,null,null,null,null,null,null,null,{"$f":"IFERROR(VLOOKUP(K149,'Tiles Remaining'!$A:$C,3,FALSE),\"\")","v":""},{"$f":"IFERROR(VLOOKUP(L149,'Tiles Remaining'!$A:$C,3,FALSE),\"\")","v":""},{"$f":"IFERROR(VLOOKUP(M149,'Tiles Remaining'!$A:$C,3,FALSE),\"\")","v":""},{"$f":"IFERROR(VLOOKUP(N149,'Tiles Remaining'!$A:$C,3,FALSE),\"\")","v":""},{"$f":"IFERROR(VLOOKUP(O149,'Tiles Remaining'!$A:$C,3,FALSE),\"\")","v":""},{"$f":"IFERROR(VLOOKUP(P149,'Tiles Remaining'!$A:$C,3,FALSE),\"\")","v":""},{"$f":"IFERROR(VLOOKUP(Q149,'Tiles Remaining'!$A:$C,3,FALSE),\"\")","v":""},{"$f":"IFERROR(VLOOKUP(R149,'Tiles Remaining'!$A:$C,3,FALSE),\"\")","v":""},{"$f":"IFERROR(VLOOKUP(S149,'Tiles Remaining'!$A:$C,3,FALSE),\"\")","v":""},{"$f":"IFERROR(VLOOKUP(T149,'Tiles Remaining'!$A:$C,3,FALSE),\"\")","v":""},{"$f":"IFERROR(VLOOKUP(U149,'Tiles Remaining'!$A:$C,3,FALSE),\"\")","v":""},{"$f":"IFERROR(VLOOKUP(V149,'Tiles Remaining'!$A:$C,3,FALSE),\"\")","v":""},{"$f":"IFERROR(VLOOKUP(W149,'Tiles Remaining'!$A:$C,3,FALSE),\"\")","v":""},{"$f":"IFERROR(VLOOKUP(X149,'Tiles Remaining'!$A:$C,3,FALSE),\"\")","v":""},{"$f":"IFERROR(VLOOKUP(Y149,'Tiles Remaining'!$A:$C,3,FALSE),\"\")","v":""},{"$f":"SUM(K150:Y150)","v":0}]
[null,null,null,null,null,null,null,null,null,null,null,"Horizontal 12 - Side B"]
[null,null,null,null,null,null,null,null,null,null,null,1,2,3,4,5,6,7,8,9,10,11,12,13,14]
[null,null,null,null,null,null,null,null,null,null,{"$f":"H28","v":""},{"$f":"IF(AND(K153<>\"\",REPLACE(K153,1,1,\"\")<>\"16\",REPLACE(K153,1,1,\"\")<>\"17\"),CONCATENATE(LEFT(K153),VALUE(REPLACE(K153,1,1,\"\"))+1),\"\")","v":""},{"$f":"IF(AND(L153<>\"\",REPLACE(L153,1,1,\"\")<>\"16\",REPLACE(L153,1,1,\"\")<>\"17\"),CONCATENATE(LEFT(L153),VALUE(REPLACE(L153,1,1,\"\"))+1),\"\")","v":""},"","","","","","","","","","","",""]
[null,null,null,null,null,null,null,null,null,null,{"$f":"IF(IFERROR(IF(K153=\"\",\"\",IF(OR($D$9=\"Horizontal\",$D$9=\"Single Letter\"),INDEX('Current Board'!$B$2:$P$16,VLOOKUP(Scorekeeping!K153,'Standard Board Scores'!$R:$U,3,FALSE),VLOOKUP(Scorekeeping!K153,'Standard Board Scores'!$R:$U,4,FALSE)),\"\")),\"\")=0,\"\",IFERROR(IF(ISERROR(K153),\"\",IF(OR($D$9=\"Horizontal\",$D$9=\"Single Letter\"),INDEX('Current Board'!$B$2:$P$16,VLOOKUP(Scorekeeping!K153,'Standard Board Scores'!$R:$U,3,FALSE),VLOOKUP(Scorekeeping!K153,'Standard Board Scores'!$R:$U,4,FALSE)),\"\")),\"\"))","v":""},{"$f":"IF(K154<>\"\",IF(IFERROR(IF(L153=\"\",\"\",IF(OR($D$9=\"Horizontal\",$D$9=\"Single Letter\"),INDEX('Current Board'!$B$2:$P$16,VLOOKUP(Scorekeeping!L153,'Standard Board Scores'!$R:$U,3,FALSE),VLOOKUP(Scorekeeping!L153,'Standard Board Scores'!$R:$U,4,FALSE)),\"\")),\"\")=0,\"\",IFERROR(IF(ISERROR(L153),\"\",IF(OR($D$9=\"Horizontal\",$D$9=\"Single Letter\"),INDEX('Current Board'!$B$2:$P$16,VLOOKUP(Scorekeeping!L153,'Standard Board Scores'!$R:$U,3,FALSE),VLOOKUP(Scorekeeping!L153,'Standard Board Scores'!$R:$U,4,FALSE)),\"\")),\"\")),\"\")","v":""},{"$f":"IF(L154<>\"\",IF(IFERROR(IF(M153=\"\",\"\",IF(OR($D$9=\"Horizontal\",$D$9=\"Single Letter\"),INDEX('Current Board'!$B$2:$P$16,VLOOKUP(Scorekeeping!M153,'Standard Board Scores'!$R:$U,3,FALSE),VLOOKUP(Scorekeeping!M153,'Standard Board Scores'!$R:$U,4,FALSE)),\"\")),\"\")=0,\"\",IFERROR(IF(ISERROR(M153),\"\",IF(OR($D$9=\"Horizontal\",$D$9=\"Single Letter\"),INDEX('Current Board'!$B$2:$P$16,VLOOKUP(Scorekeeping!M153,'Standard Board Scores'!$R:$U,3,FALSE),VLOOKUP(Scorekeeping!M153,'Standard Board Scores'!$R:$U,4,FALSE)),\"\")),\"\")),\"\")","v":""},{"$f":"IF(M154<>\"\",IF(IFERROR(IF(N153=\"\",\"\",IF(OR($D$9=\"Horizontal\",$D$9=\"Single Letter\"),INDEX('Current Board'!$B$2:$P$16,VLOOKUP(Scorekeeping!N153,'Standard Board Scores'!$R:$U,3,FALSE),VLOOKUP(Scorekeeping!N153,'Standard Board Scores'!$R:$U,4,FALSE)),\"\")),\"\")=0,\"\",IFERROR(IF(ISERROR(N153),\"\",IF(OR($D$9=\"Horizontal\",$D$9=\"Single Letter\"),INDEX('Current Board'!$B$2:$P$16,VLOOKUP(Scorekeeping!N153,'Standard Board Scores'!$R:$U,3,FALSE),VLOOKUP(Scorekeeping!N153,'Standard Board Scores'!$R:$U,4,FALSE)),\"\")),\"\")),\"\")","v":""},{"$f":"IF(N154<>\"\",IF(IFERROR(IF(O153=\"\",\"\",IF(OR($D$9=\"Horizontal\",$D$9=\"Single Letter\"),INDEX('Current Board'!$B$2:$P$16,VLOOKUP(Scorekeeping!O153,'Standard Board Scores'!$R:$U,3,FALSE),VLOOKUP(Scorekeeping!O153,'Standard Board Scores'!$R:$U,4,FALSE)),\"\")),\"\")=0,\"\",IFERROR(IF(ISERROR(O153),\"\",IF(OR($D$9=\"Horizontal\",$D$9=\"Single Letter\"),INDEX('Current Board'!$B$2:$P$16,VLOOKUP(Scorekeeping!O153,'Standard Board Scores'!$R:$U,3,FALSE),VLOOKUP(Scorekeeping!O153,'Standard Board Scores'!$R:$U,4,FALSE)),\"\")),\"\")),\"\")","v":""},{"$f":"IF(O154<>\"\",IF(IFERROR(IF(P153=\"\",\"\",IF(OR($D$9=\"Horizontal\",$D$9=\"Single Letter\"),INDEX('Current Board'!$B$2:$P$16,VLOOKUP(Scorekeeping!P153,'Standard Board Scores'!$R:$U,3,FALSE),VLOOKUP(Scorekeeping!P153,'Standard Board Scores'!$R:$U,4,FALSE)),\"\")),\"\")=0,\"\",IFERROR(IF(ISERROR(P153),\"\",IF(OR($D$9=\"Horizontal\",$D$9=\"Single Letter\"),INDEX('Current Board'!$B$2:$P$16,VLOOKUP(Scorekeeping!P153,'Standard Board Scores'!$R:$U,3,FALSE),VLOOKUP(Scorekeeping!P153,'Standard Board Scores'!$R:$U,4,FALSE)),\"\")),\"\")),\"\")","v":""},{"$f":"IF(P154<>\"\",IF(IFERROR(IF(Q153=\"\",\"\",IF(OR($D$9=\"Horizontal\",$D$9=\"Single Letter\"),INDEX('Current Board'!$B$2:$P$16,VLOOKUP(Scorekeeping!Q153,'Standard Board Scores'!$R:$U,3,FALSE),VLOOKUP(Scorekeeping!Q153,'Standard Board Scores'!$R:$U,4,FALSE)),\"\")),\"\")=0,\"\",IFERROR(IF(ISERROR(Q153),\"\",IF(OR($D$9=\"Horizontal\",$D$9=\"Single Letter\"),INDEX('Current Board'!$B$2:$P$16,VLOOKUP(Scorekeeping!Q153,'Standard Board Scores'!$R:$U,3,FALSE),VLOOKUP(Scorekeeping!Q153,'Standard Board Scores'!$R:$U,4,FALSE)),\"\")),\"\")),\"\")","v":""},{"$f":"IF(Q154<>\"\",IF(IFERROR(IF(R153=\"\",\"\",IF(OR($D$9=\"Horizontal\",$D$9=\"Single Letter\"),INDEX('Current Board'!$B$2:$P$16,VLOOKUP(Scorekeeping!R153,'Standard Board Scores'!$R:$U,3,FALSE),VLOOKUP(Scorekeeping!R153,'Standard Board Scores'!$R:$U,4,FALSE)),\"\")),\"\")=0,\"\",IFERROR(IF(ISERROR(R153),\"\",IF(OR($D$9=\"Horizontal\",$D$9=\"Single Letter\"),INDEX('Current Board'!$B$2:$P$16,VLOOKUP(Scorekeeping!R153,'Standard Board Scores'!$R:$U,3,FALSE),VLOOKUP(Scorekeeping!R153,'Standard Board Scores'!$R:$U,4,FALSE)),\"\")),\"\")),\"\")","v":""},{"$f":"IF(R154<>\"\",IF(IFERROR(IF(S153=\"\",\"\",IF(OR($D$9=\"Horizontal\",$D$9=\"Single Letter\"),INDEX('Current Board'!$B$2:$P$16,VLOOKUP(Scorekeeping!S153,'Standard Board Scores'!$R:$U,3,FALSE),VLOOKUP(Scorekeeping!S153,'Standard Board Scores'!$R:$U,4,FALSE)),\"\")),\"\")=0,\"\",IFERROR(IF(ISERROR(S153),\"\",IF(OR($D$9=\"Horizontal\",$D$9=\"Single Letter\"),INDEX('Current Board'!$B$2:$P$16,VLOOKUP(Scorekeeping!S153,'Standard Board Scores'!$R:$U,3,FALSE),VLOOKUP(Scorekeeping!S153,'Standard Board Scores'!$R:$U,4,FALSE)),\"\")),\"\")),\"\")","v":""},{"$f":"IF(S154<>\"\",IF(IFERROR(IF(T153=\"\",\"\",IF(OR($D$9=\"Horizontal\",$D$9=\"Single Letter\"),INDEX('Current Board'!$B$2:$P$16,VLOOKUP(Scorekeeping!T153,'Standard Board Scores'!$R:$U,3,FALSE),VLOOKUP(Scorekeeping!T153,'Standard Board Scores'!$R:$U,4,FALSE)),\"\")),\"\")=0,\"\",IFERROR(IF(ISERROR(T153),\"\",IF(OR($D$9=\"Horizontal\",$D$9=\"Single Letter\"),INDEX('Current Board'!$B$2:$P$16,VLOOKUP(Scorekeeping!T153,'Standard Board Scores'!$R:$U,3,FALSE),VLOOKUP(Scorekeeping!T153,'Standard Board Scores'!$R:$U,4,FALSE)),\"\")),\"\")),\"\")","v":""},{"$f":"IF(T154<>\"\",IF(IFERROR(IF(U153=\"\",\"\",IF(OR($D$9=\"Horizontal\",$D$9=\"Single Letter\"),INDEX('Current Board'!$B$2:$P$16,VLOOKUP(Scorekeeping!U153,'Standard Board Scores'!$R:$U,3,FALSE),VLOOKUP(Scorekeeping!U153,'Standard Board Scores'!$R:$U,4,FALSE)),\"\")),\"\")=0,\"\",IFERROR(IF(ISERROR(U153),\"\",IF(OR($D$9=\"Horizontal\",$D$9=\"Single Letter\"),INDEX('Current Board'!$B$2:$P$16,VLOOKUP(Scorekeeping!U153,'Standard Board Scores'!$R:$U,3,FALSE),VLOOKUP(Scorekeeping!U153,'Standard Board Scores'!$R:$U,4,FALSE)),\"\")),\"\")),\"\")","v":""},{"$f":"IF(U154<>\"\",IF(IFERROR(IF(V153=\"\",\"\",IF(OR($D$9=\"Horizontal\",$D$9=\"Single Letter\"),INDEX('Current Board'!$B$2:$P$16,VLOOKUP(Scorekeeping!V153,'Standard Board Scores'!$R:$U,3,FALSE),VLOOKUP(Scorekeeping!V153,'Standard Board Scores'!$R:$U,4,FALSE)),\"\")),\"\")=0,\"\",IFERROR(IF(ISERROR(V153),\"\",IF(OR($D$9=\"Horizontal\",$D$9=\"Single Letter\"),INDEX('Current Board'!$B$2:$P$16,VLOOKUP(Scorekeeping!V153,'Standard Board Scores'!$R:$U,3,FALSE),VLOOKUP(Scorekeeping!V153,'Standard Board Scores'!$R:$U,4,FALSE)),\"\")),\"\")),\"\")","v":""},{"$f":"IF(V154<>\"\",IF(IFERROR(IF(W153=\"\",\"\",IF(OR($D$9=\"Horizontal\",$D$9=\"Single Letter\"),INDEX('Current Board'!$B$2:$P$16,VLOOKUP(Scorekeeping!W153,'Standard Board Scores'!$R:$U,3,FALSE),VLOOKUP(Scorekeeping!W153,'Standard Board Scores'!$R:$U,4,FALSE)),\"\")),\"\")=0,\"\",IFERROR(IF(ISERROR(W153),\"\",IF(OR($D$9=\"Horizontal\",$D$9=\"Single Letter\"),INDEX('Current Board'!$B$2:$P$16,VLOOKUP(Scorekeeping!W153,'Standard Board Scores'!$R:$U,3,FALSE),VLOOKUP(Scorekeeping!W153,'Standard Board Scores'!$R:$U,4,FALSE)),\"\")),\"\")),\"\")","v":""},{"$f":"IF(W154<>\"\",IF(IFERROR(IF(X153=\"\",\"\",IF(OR($D$9=\"Horizontal\",$D$9=\"Single Letter\"),INDEX('Current Board'!$B$2:$P$16,VLOOKUP(Scorekeeping!X153,'Standard Board Scores'!$R:$U,3,FALSE),VLOOKUP(Scorekeeping!X153,'Standard Board Scores'!$R:$U,4,FALSE)),\"\")),\"\")=0,\"\",IFERROR(IF(ISERROR(X153),\"\",IF(OR($D$9=\"Horizontal\",$D$9=\"Single Letter\"),INDEX('Current Board'!$B$2:$P$16,VLOOKUP(Scorekeeping!X153,'Standard Board Scores'!$R:$U,3,FALSE),VLOOKUP(Scorekeeping!X153,'Standard Board Scores'!$R:$U,4,FALSE)),\"\")),\"\")),\"\")","v":""},{"$f":"IF(X154<>\"\",IF(IFERROR(IF(Y153=\"\",\"\",IF(OR($D$9=\"Horizontal\",$D$9=\"Single Letter\"),INDEX('Current Board'!$B$2:$P$16,VLOOKUP(Scorekeeping!Y153,'Standard Board Scores'!$R:$U,3,FALSE),VLOOKUP(Scorekeeping!Y153,'Standard Board Scores'!$R:$U,4,FALSE)),\"\")),\"\")=0,\"\",IFERROR(IF(ISERROR(Y153),\"\",IF(OR($D$9=\"Horizontal\",$D$9=\"Single Letter\"),INDEX('Current Board'!$B$2:$P$16,VLOOKUP(Scorekeeping!Y153,'Standard Board Scores'!$R:$U,3,FALSE),VLOOKUP(Scorekeeping!Y153,'Standard Board Scores'!$R:$U,4,FALSE)),\"\")),\"\")),\"\")","v":""}]
[null,null,null,null,null,null,null,null,null,null,{"$f":"IFERROR(VLOOKUP(K154,'Tiles Remaining'!$A:$C,3,FALSE),\"\")","v":""},{"$f":"IFERROR(VLOOKUP(L154,'Tiles Remaining'!$A:$C,3,FALSE),\"\")","v":""},{"$f":"IFERROR(VLOOKUP(M154,'Tiles Remaining'!$A:$C,3,FALSE),\"\")","v":""},{"$f":"IFERROR(VLOOKUP(N154,'Tiles Remaining'!$A:$C,3,FALSE),\"\")","v":""},{"$f":"IFERROR(VLOOKUP(O154,'Tiles Remaining'!$A:$C,3,FALSE),\"\")","v":""},{"$f":"IFERROR(VLOOKUP(P154,'Tiles Remaining'!$A:$C,3,FALSE),\"\")","v":""},{"$f":"IFERROR(VLOOKUP(Q154,'Tiles Remaining'!$A:$C,3,FALSE),\"\")","v":""},{"$f":"IFERROR(VLOOKUP(R154,'Tiles Remaining'!$A:$C,3,FALSE),\"\")","v":""},{"$f":"IFERROR(VLOOKUP(S154,'Tiles Remaining'!$A:$C,3,FALSE),\"\")","v":""},{"$f":"IFERROR(VLOOKUP(T154,'Tiles Remaining'!$A:$C,3,FALSE),\"\")","v":""},{"$f":"IFERROR(VLOOKUP(U154,'Tiles Remaining'!$A:$C,3,FALSE),\"\")","v":""},{"$f":"IFERROR(VLOOKUP(V154,'Tiles Remaining'!$A:$C,3,FALSE),\"\")","v":""},{"$f":"IFERROR(VLOOKUP(W154,'Tiles Remaining'!$A:$C,3,FALSE),\"\")","v":""},{"$f":"IFERROR(VLOOKUP(X154,'Tiles Remaining'!$A:$C,3,FALSE),\"\")","v":""},{"$f":"IFERROR(VLOOKUP(Y154,'Tiles Remaining'!$A:$C,3,FALSE),\"\")","v":""},{"$f":"SUM(K155:Y155)","v":0}]
[null,null,null,null,null,null,null,null,null,null,null,"Horizontal 13 - Side B"]
[null,null,null,null,null,null,null,null,null,null,null,1,2,3,4,5,6,7,8,9,10,11,12,13,14]
[null,null,null,null,null,null,null,null,null,null,{"$f":"I28","v":""},{"$f":"IF(AND(K158<>\"\",REPLACE(K158,1,1,\"\")<>\"16\",REPLACE(K158,1,1,\"\")<>\"17\"),CONCATENATE(LEFT(K158),VALUE(REPLACE(K158,1,1,\"\"))+1),\"\")","v":""},{"$f":"IF(AND(L158<>\"\",REPLACE(L158,1,1,\"\")<>\"16\",REPLACE(L158,1,1,\"\")<>\"17\"),CONCATENATE(LEFT(L158),VALUE(REPLACE(L158,1,1,\"\"))+1),\"\")","v":""},"","","","","","","","","","","",""]
[null,null,null,null,null,null,null,null,null,null,{"$f":"IF(IFERROR(IF(K158=\"\",\"\",IF(OR($D$9=\"Horizontal\",$D$9=\"Single Letter\"),INDEX('Current Board'!$B$2:$P$16,VLOOKUP(Scorekeeping!K158,'Standard Board Scores'!$R:$U,3,FALSE),VLOOKUP(Scorekeeping!K158,'Standard Board Scores'!$R:$U,4,FALSE)),\"\")),\"\")=0,\"\",IFERROR(IF(ISERROR(K158),\"\",IF(OR($D$9=\"Horizontal\",$D$9=\"Single Letter\"),INDEX('Current Board'!$B$2:$P$16,VLOOKUP(Scorekeeping!K158,'Standard Board Scores'!$R:$U,3,FALSE),VLOOKUP(Scorekeeping!K158,'Standard Board Scores'!$R:$U,4,FALSE)),\"\")),\"\"))","v":""},{"$f":"IF(K159<>\"\",IF(IFERROR(IF(L158=\"\",\"\",IF(OR($D$9=\"Horizontal\",$D$9=\"Single Letter\"),INDEX('Current Board'!$B$2:$P$16,VLOOKUP(Scorekeeping!L158,'Standard Board Scores'!$R:$U,3,FALSE),VLOOKUP(Scorekeeping!L158,'Standard Board Scores'!$R:$U,4,FALSE)),\"\")),\"\")=0,\"\",IFERROR(IF(ISERROR(L158),\"\",IF(OR($D$9=\"Horizontal\",$D$9=\"Single Letter\"),INDEX('Current Board'!$B$2:$P$16,VLOOKUP(Scorekeeping!L158,'Standard Board Scores'!$R:$U,3,FALSE),VLOOKUP(Scorekeeping!L158,'Standard Board Scores'!$R:$U,4,FALSE)),\"\")),\"\")),\"\")","v":""},{"$f":"IF(L159<>\"\",IF(IFERROR(IF(M158=\"\",\"\",IF(OR($D$9=\"Horizontal\",$D$9=\"Single Letter\"),INDEX('Current Board'!$B$2:$P$16,VLOOKUP(Scorekeeping!M158,'Standard Board Scores'!$R:$U,3,FALSE),VLOOKUP(Scorekeeping!M158,'Standard Board Scores'!$R:$U,4,FALSE)),\"\")),\"\")=0,\"\",IFERROR(IF(ISERROR(M158),\"\",IF(OR($D$9=\"Horizontal\",$D$9=\"Single Letter\"),INDEX('Current Board'!$B$2:$P$16,VLOOKUP(Scorekeeping!M158,'Standard Board Scores'!$R:$U,3,FALSE),VLOOKUP(Scorekeeping!M158,'Standard Board Scores'!$R:$U,4,FALSE)),\"\")),\"\")),\"\")","v":""},{"$f":"IF(M159<>\"\",IF(IFERROR(IF(N158=\"\",\"\",IF(OR($D$9=\"Horizontal\",$D$9=\"Single Letter\"),INDEX('Current Board'!$B$2:$P$16,VLOOKUP(Scorekeeping!N158,'Standard Board Scores'!$R:$U,3,FALSE),VLOOKUP(Scorekeeping!N158,'Standard Board Scores'!$R:$U,4,FALSE)),\"\")),\"\")=0,\"\",IFERROR(IF(ISERROR(N158),\"\",IF(OR($D$9=\"Horizontal\",$D$9=\"Single Letter\"),INDEX('Current Board'!$B$2:$P$16,VLOOKUP(Scorekeeping!N158,'Standard Board Scores'!$R:$U,3,FALSE),VLOOKUP(Scorekeeping!N158,'Standard Board Scores'!$R:$U,4,FALSE)),\"\")),\"\")),\"\")","v":""},{"$f":"IF(N159<>\"\",IF(IFERROR(IF(O158=\"\",\"\",IF(OR($D$9=\"Horizontal\",$D$9=\"Single Letter\"),INDEX('Current Board'!$B$2:$P$16,VLOOKUP(Scorekeeping!O158,'Standard Board Scores'!$R:$U,3,FALSE),VLOOKUP(Scorekeeping!O158,'Standard Board Scores'!$R:$U,4,FALSE)),\"\")),\"\")=0,\"\",IFERROR(IF(ISERROR(O158),\"\",IF(OR($D$9=\"Horizontal\",$D$9=\"Single Letter\"),INDEX('Current Board'!$B$2:$P$16,VLOOKUP(Scorekeeping!O158,'Standard Board Scores'!$R:$U,3,FALSE),VLOOKUP(Scorekeeping!O158,'Standard Board Scores'!$R:$U,4,FALSE)),\"\")),\"\")),\"\")","v":""},{"$f":"IF(O159<>\"\",IF(IFERROR(IF(P158=\"\",\"\",IF(OR($D$9=\"Horizontal\",$D$9=\"Single Letter\"),INDEX('Current Board'!$B$2:$P$16,VLOOKUP(Scorekeeping!P158,'Standard Board Scores'!$R:$U,3,FALSE),VLOOKUP(Scorekeeping!P158,'Standard Board Scores'!$R:$U,4,FALSE)),\"\")),\"\")=0,\"\",IFERROR(IF(ISERROR(P158),\"\",IF(OR($D$9=\"Horizontal\",$D$9=\"Single Letter\"),INDEX('Current Board'!$B$2:$P$16,VLOOKUP(Scorekeeping!P158,'Standard Board Scores'!$R:$U,3,FALSE),VLOOKUP(Scorekeeping!P158,'Standard Board Scores'!$R:$U,4,FALSE)),\"\")),\"\")),\"\")","v":""},{"$f":"IF(P159<>\"\",IF(IFERROR(IF(Q158=\"\",\"\",IF(OR($D$9=\"Horizontal\",$D$9=\"Single Letter\"),INDEX('Current Board'!$B$2:$P$16,VLOOKUP(Scorekeeping!Q158,'Standard Board Scores'!$R:$U,3,FALSE),VLOOKUP(Scorekeeping!Q158,'Standard Board Scores'!$R:$U,4,FALSE)),\"\")),\"\")=0,\"\",IFERROR(IF(ISERROR(Q158),\"\",IF(OR($D$9=\"Horizontal\",$D$9=\"Single Letter\"),INDEX('Current Board'!$B$2:$P$16,VLOOKUP(Scorekeeping!Q158,'Standard Board Scores'!$R:$U,3,FALSE),VLOOKUP(Scorekeeping!Q158,'Standard Board Scores'!$R:$U,4,FALSE)),\"\")),\"\")),\"\")","v":""},{"$f":"IF(Q159<>\"\",IF(IFERROR(IF(R158=\"\",\"\",IF(OR($D$9=\"Horizontal\",$D$9=\"Single Letter\"),INDEX('Current Board'!$B$2:$P$16,VLOOKUP(Scorekeeping!R158,'Standard Board Scores'!$R:$U,3,FALSE),VLOOKUP(Scorekeeping!R158,'Standard Board Scores'!$R:$U,4,FALSE)),\"\")),\"\")=0,\"\",IFERROR(IF(ISERROR(R158),\"\",IF(OR($D$9=\"Horizontal\",$D$9=\"Single Letter\"),INDEX('Current Board'!$B$2:$P$16,VLOOKUP(Scorekeeping!R158,'Standard Board Scores'!$R:$U,3,FALSE),VLOOKUP(Scorekeeping!R158,'Standard Board Scores'!$R:$U,4,FALSE)),\"\")),\"\")),\"\")","v":""},{"$f":"IF(R159<>\"\",IF(IFERROR(IF(S158=\"\",\"\",IF(OR($D$9=\"Horizontal\",$D$9=\"Single Letter\"),INDEX('Current Board'!$B$2:$P$16,VLOOKUP(Scorekeeping!S158,'Standard Board Scores'!$R:$U,3,FALSE),VLOOKUP(Scorekeeping!S158,'Standard Board Scores'!$R:$U,4,FALSE)),\"\")),\"\")=0,\"\",IFERROR(IF(ISERROR(S158),\"\",IF(OR($D$9=\"Horizontal\",$D$9=\"Single Letter\"),INDEX('Current Board'!$B$2:$P$16,VLOOKUP(Scorekeeping!S158,'Standard Board Scores'!$R:$U,3,FALSE),VLOOKUP(Scorekeeping!S158,'Standard Board Scores'!$R:$U,4,FALSE)),\"\")),\"\")),\"\")","v":""},{"$f":"IF(S159<>\"\",IF(IFERROR(IF(T158=\"\",\"\",IF(OR($D$9=\"Horizontal\",$D$9=\"Single Letter\"),INDEX('Current Board'!$B$2:$P$16,VLOOKUP(Scorekeeping!T158,'Standard Board Scores'!$R:$U,3,FALSE),VLOOKUP(Scorekeeping!T158,'Standard Board Scores'!$R:$U,4,FALSE)),\"\")),\"\")=0,\"\",IFERROR(IF(ISERROR(T158),\"\",IF(OR($D$9=\"Horizontal\",$D$9=\"Single Letter\"),INDEX('Current Board'!$B$2:$P$16,VLOOKUP(Scorekeeping!T158,'Standard Board Scores'!$R:$U,3,FALSE),VLOOKUP(Scorekeeping!T158,'Standard Board Scores'!$R:$U,4,FALSE)),\"\")),\"\")),\"\")","v":""},{"$f":"IF(T159<>\"\",IF(IFERROR(IF(U158=\"\",\"\",IF(OR($D$9=\"Horizontal\",$D$9=\"Single Letter\"),INDEX('Current Board'!$B$2:$P$16,VLOOKUP(Scorekeeping!U158,'Standard Board Scores'!$R:$U,3,FALSE),VLOOKUP(Scorekeeping!U158,'Standard Board Scores'!$R:$U,4,FALSE)),\"\")),\"\")=0,\"\",IFERROR(IF(ISERROR(U158),\"\",IF(OR($D$9=\"Horizontal\",$D$9=\"Single Letter\"),INDEX('Current Board'!$B$2:$P$16,VLOOKUP(Scorekeeping!U158,'Standard Board Scores'!$R:$U,3,FALSE),VLOOKUP(Scorekeeping!U158,'Standard Board Scores'!$R:$U,4,FALSE)),\"\")),\"\")),\"\")","v":""},{"$f":"IF(U159<>\"\",IF(IFERROR(IF(V158=\"\",\"\",IF(OR($D$9=\"Horizontal\",$D$9=\"Single Letter\"),INDEX('Current Board'!$B$2:$P$16,VLOOKUP(Scorekeeping!V158,'Standard Board Scores'!$R:$U,3,FALSE),VLOOKUP(Scorekeeping!V158,'Standard Board Scores'!$R:$U,4,FALSE)),\"\")),\"\")=0,\"\",IFERROR(IF(ISERROR(V158),\"\",IF(OR($D$9=\"Horizontal\",$D$9=\"Single Letter\"),INDEX('Current Board'!$B$2:$P$16,VLOOKUP(Scorekeeping!V158,'Standard Board Scores'!$R:$U,3,FALSE),VLOOKUP(Scorekeeping!V158,'Standard Board Scores'!$R:$U,4,FALSE)),\"\")),\"\")),\"\")","v":""},{"$f":"IF(V159<>\"\",IF(IFERROR(IF(W158=\"\",\"\",IF(OR($D$9=\"Horizontal\",$D$9=\"Single Letter\"),INDEX('Current Board'!$B$2:$P$16,VLOOKUP(Scorekeeping!W158,'Standard Board Scores'!$R:$U,3,FALSE),VLOOKUP(Scorekeeping!W158,'Standard Board Scores'!$R:$U,4,FALSE)),\"\")),\"\")=0,\"\",IFERROR(IF(ISERROR(W158),\"\",IF(OR($D$9=\"Horizontal\",$D$9=\"Single Letter\"),INDEX('Current Board'!$B$2:$P$16,VLOOKUP(Scorekeeping!W158,'Standard Board Scores'!$R:$U,3,FALSE),VLOOKUP(Scorekeeping!W158,'Standard Board Scores'!$R:$U,4,FALSE)),\"\")),\"\")),\"\")","v":""},{"$f":"IF(W159<>\"\",IF(IFERROR(IF(X158=\"\",\"\",IF(OR($D$9=\"Horizontal\",$D$9=\"Single Letter\"),INDEX('Current Board'!$B$2:$P$16,VLOOKUP(Scorekeeping!X158,'Standard Board Scores'!$R:$U,3,FALSE),VLOOKUP(Scorekeeping!X158,'Standard Board Scores'!$R:$U,4,FALSE)),\"\")),\"\")=0,\"\",IFERROR(IF(ISERROR(X158),\"\",IF(OR($D$9=\"Horizontal\",$D$9=\"Single Letter\"),INDEX('Current Board'!$B$2:$P$16,VLOOKUP(Scorekeeping!X158,'Standard Board Scores'!$R:$U,3,FALSE),VLOOKUP(Scorekeeping!X158,'Standard Board Scores'!$R:$U,4,FALSE)),\"\")),\"\")),\"\")","v":""},{"$f":"IF(X159<>\"\",IF(IFERROR(IF(Y158=\"\",\"\",IF(OR($D$9=\"Horizontal\",$D$9=\"Single Letter\"),INDEX('Current Board'!$B$2:$P$16,VLOOKUP(Scorekeeping!Y158,'Standard Board Scores'!$R:$U,3,FALSE),VLOOKUP(Scorekeeping!Y158,'Standard Board Scores'!$R:$U,4,FALSE)),\"\")),\"\")=0,\"\",IFERROR(IF(ISERROR(Y158),\"\",IF(OR($D$9=\"Horizontal\",$D$9=\"Single Letter\"),INDEX('Current Board'!$B$2:$P$16,VLOOKUP(Scorekeeping!Y158,'Standard Board Scores'!$R:$U,3,FALSE),VLOOKUP(Scorekeeping!Y158,'Standard Board Scores'!$R:$U,4,FALSE)),\"\")),\"\")),\"\")","v":""}]
[null,null,null,null,null,null,null,null,null,null,{"$f":"IFERROR(VLOOKUP(K159,'Tiles Remaining'!$A:$C,3,FALSE),\"\")","v":""},{"$f":"IFERROR(VLOOKUP(L159,'Tiles Remaining'!$A:$C,3,FALSE),\"\")","v":""},{"$f":"IFERROR(VLOOKUP(M159,'Tiles Remaining'!$A:$C,3,FALSE),\"\")","v":""},{"$f":"IFERROR(VLOOKUP(N159,'Tiles Remaining'!$A:$C,3,FALSE),\"\")","v":""},{"$f":"IFERROR(VLOOKUP(O159,'Tiles Remaining'!$A:$C,3,FALSE),\"\")","v":""},{"$f":"IFERROR(VLOOKUP(P159,'Tiles Remaining'!$A:$C,3,FALSE),\"\")","v":""},{"$f":"IFERROR(VLOOKUP(Q159,'Tiles Remaining'!$A:$C,3,FALSE),\"\")","v":""},{"$f":"IFERROR(VLOOKUP(R159,'Tiles Remaining'!$A:$C,3,FALSE),\"\")","v":""},{"$f":"IFERROR(VLOOKUP(S159,'Tiles Remaining'!$A:$C,3,FALSE),\"\")","v":""},{"$f":"IFERROR(VLOOKUP(T159,'Tiles Remaining'!$A:$C,3,FALSE),\"\")","v":""},{"$f":"IFERROR(VLOOKUP(U159,'Tiles Remaining'!$A:$C,3,FALSE),\"\")","v":""},{"$f":"IFERROR(VLOOKUP(V159,'Tiles Remaining'!$A:$C,3,FALSE),\"\")","v":""},{"$f":"IFERROR(VLOOKUP(W159,'Tiles Remaining'!$A:$C,3,FALSE),\"\")","v":""},{"$f":"IFERROR(VLOOKUP(X159,'Tiles Remaining'!$A:$C,3,FALSE),\"\")","v":""},{"$f":"IFERROR(VLOOKUP(Y159,'Tiles Remaining'!$A:$C,3,FALSE),\"\")","v":""},{"$f":"SUM(K160:Y160)","v":0}]
[null,null,null,null,null,null,null,null,null,null,null,"Horizontal 14 - Side B"]
[null,null,null,null,null,null,null,null,null,null,null,1,2,3,4,5,6,7,8,9,10,11,12,13,14]
[null,null,null,null,null,null,null,null,null,null,{"$f":"J28","v":""},{"$f":"IF(AND(K163<>\"\",REPLACE(K163,1,1,\"\")<>\"16\",REPLACE(K163,1,1,\"\")<>\"17\"),CONCATENATE(LEFT(K163),VALUE(REPLACE(K163,1,1,\"\"))+1),\"\")","v":""},{"$f":"IF(AND(L163<>\"\",REPLACE(L163,1,1,\"\")<>\"16\",REPLACE(L163,1,1,\"\")<>\"17\"),CONCATENATE(LEFT(L163),VALUE(REPLACE(L163,1,1,\"\"))+1),\"\")","v":""},"","","","","","","","","","","",""]
[null,null,null,null,null,null,null,null,null,null,{"$f":"IF(IFERROR(IF(K163=\"\",\"\",IF(OR($D$9=\"Horizontal\",$D$9=\"Single Letter\"),INDEX('Current Board'!$B$2:$P$16,VLOOKUP(Scorekeeping!K163,'Standard Board Scores'!$R:$U,3,FALSE),VLOOKUP(Scorekeeping!K163,'Standard Board Scores'!$R:$U,4,FALSE)),\"\")),\"\")=0,\"\",IFERROR(IF(ISERROR(K163),\"\",IF(OR($D$9=\"Horizontal\",$D$9=\"Single Letter\"),INDEX('Current Board'!$B$2:$P$16,VLOOKUP(Scorekeeping!K163,'Standard Board Scores'!$R:$U,3,FALSE),VLOOKUP(Scorekeeping!K163,'Standard Board Scores'!$R:$U,4,FALSE)),\"\")),\"\"))","v":""},{"$f":"IF(K164<>\"\",IF(IFERROR(IF(L163=\"\",\"\",IF(OR($D$9=\"Horizontal\",$D$9=\"Single Letter\"),INDEX('Current Board'!$B$2:$P$16,VLOOKUP(Scorekeeping!L163,'Standard Board Scores'!$R:$U,3,FALSE),VLOOKUP(Scorekeeping!L163,'Standard Board Scores'!$R:$U,4,FALSE)),\"\")),\"\")=0,\"\",IFERROR(IF(ISERROR(L163),\"\",IF(OR($D$9=\"Horizontal\",$D$9=\"Single Letter\"),INDEX('Current Board'!$B$2:$P$16,VLOOKUP(Scorekeeping!L163,'Standard Board Scores'!$R:$U,3,FALSE),VLOOKUP(Scorekeeping!L163,'Standard Board Scores'!$R:$U,4,FALSE)),\"\")),\"\")),\"\")","v":""},{"$f":"IF(L164<>\"\",IF(IFERROR(IF(M163=\"\",\"\",IF(OR($D$9=\"Horizontal\",$D$9=\"Single Letter\"),INDEX('Current Board'!$B$2:$P$16,VLOOKUP(Scorekeeping!M163,'Standard Board Scores'!$R:$U,3,FALSE),VLOOKUP(Scorekeeping!M163,'Standard Board Scores'!$R:$U,4,FALSE)),\"\")),\"\")=0,\"\",IFERROR(IF(ISERROR(M163),\"\",IF(OR($D$9=\"Horizontal\",$D$9=\"Single Letter\"),INDEX('Current Board'!$B$2:$P$16,VLOOKUP(Scorekeeping!M163,'Standard Board Scores'!$R:$U,3,FALSE),VLOOKUP(Scorekeeping!M163,'Standard Board Scores'!$R:$U,4,FALSE)),\"\")),\"\")),\"\")","v":""},{"$f":"IF(M164<>\"\",IF(IFERROR(IF(N163=\"\",\"\",IF(OR($D$9=\"Horizontal\",$D$9=\"Single Letter\"),INDEX('Current Board'!$B$2:$P$16,VLOOKUP(Scorekeeping!N163,'Standard Board Scores'!$R:$U,3,FALSE),VLOOKUP(Scorekeeping!N163,'Standard Board Scores'!$R:$U,4,FALSE)),\"\")),\"\")=0,\"\",IFERROR(IF(ISERROR(N163),\"\",IF(OR($D$9=\"Horizontal\",$D$9=\"Single Letter\"),INDEX('Current Board'!$B$2:$P$16,VLOOKUP(Scorekeeping!N163,'Standard Board Scores'!$R:$U,3,FALSE),VLOOKUP(Scorekeeping!N163,'Standard Board Scores'!$R:$U,4,FALSE)),\"\")),\"\")),\"\")","v":""},{"$f":"IF(N164<>\"\",IF(IFERROR(IF(O163=\"\",\"\",IF(OR($D$9=\"Horizontal\",$D$9=\"Single Letter\"),INDEX('Current Board'!$B$2:$P$16,VLOOKUP(Scorekeeping!O163,'Standard Board Scores'!$R:$U,3,FALSE),VLOOKUP(Scorekeeping!O163,'Standard Board Scores'!$R:$U,4,FALSE)),\"\")),\"\")=0,\"\",IFERROR(IF(ISERROR(O163),\"\",IF(OR($D$9=\"Horizontal\",$D$9=\"Single Letter\"),INDEX('Current Board'!$B$2:$P$16,VLOOKUP(Scorekeeping!O163,'Standard Board Scores'!$R:$U,3,FALSE),VLOOKUP(Scorekeeping!O163,'Standard Board Scores'!$R:$U,4,FALSE)),\"\")),\"\")),\"\")","v":""},{"$f":"IF(O164<>\"\",IF(IFERROR(IF(P163=\"\",\"\",IF(OR($D$9=\"Horizontal\",$D$9=\"Single Letter\"),INDEX('Current Board'!$B$2:$P$16,VLOOKUP(Scorekeeping!P163,'Standard Board Scores'!$R:$U,3,FALSE),VLOOKUP(Scorekeeping!P163,'Standard Board Scores'!$R:$U,4,FALSE)),\"\")),\"\")=0,\"\",IFERROR(IF(ISERROR(P163),\"\",IF(OR($D$9=\"Horizontal\",$D$9=\"Single Letter\"),INDEX('Current Board'!$B$2:$P$16,VLOOKUP(Scorekeeping!P163,'Standard Board Scores'!$R:$U,3,FALSE),VLOOKUP(Scorekeeping!P163,'Standard Board Scores'!$R:$U,4,FALSE)),\"\")),\"\")),\"\")","v":""},{"$f":"IF(P164<>\"\",IF(IFERROR(IF(Q163=\"\",\"\",IF(OR($D$9=\"Horizontal\",$D$9=\"Single Letter\"),INDEX('Current Board'!$B$2:$P$16,VLOOKUP(Scorekeeping!Q163,'Standard Board Scores'!$R:$U,3,FALSE),VLOOKUP(Scorekeeping!Q163,'Standard Board Scores'!$R:$U,4,FALSE)),\"\")),\"\")=0,\"\",IFERROR(IF(ISERROR(Q163),\"\",IF(OR($D$9=\"Horizontal\",$D$9=\"Single Letter\"),INDEX('Current Board'!$B$2:$P$16,VLOOKUP(Scorekeeping!Q163,'Standard Board Scores'!$R:$U,3,FALSE),VLOOKUP(Scorekeeping!Q163,'Standard Board Scores'!$R:$U,4,FALSE)),\"\")),\"\")),\"\")","v":""},{"$f":"IF(Q164<>\"\",IF(IFERROR(IF(R163=\"\",\"\",IF(OR($D$9=\"Horizontal\",$D$9=\"Single Letter\"),INDEX('Current Board'!$B$2:$P$16,VLOOKUP(Scorekeeping!R163,'Standard Board Scores'!$R:$U,3,FALSE),VLOOKUP(Scorekeeping!R163,'Standard Board Scores'!$R:$U,4,FALSE)),\"\")),\"\")=0,\"\",IFERROR(IF(ISERROR(R163),\"\",IF(OR($D$9=\"Horizontal\",$D$9=\"Single Letter\"),INDEX('Current Board'!$B$2:$P$16,VLOOKUP(Scorekeeping!R163,'Standard Board Scores'!$R:$U,3,FALSE),VLOOKUP(Scorekeeping!R163,'Standard Board Scores'!$R:$U,4,FALSE)),\"\")),\"\")),\"\")","v":""},{"$f":"IF(R164<>\"\",IF(IFERROR(IF(S163=\"\",\"\",IF(OR($D$9=\"Horizontal\",$D$9=\"Single Letter\"),INDEX('Current Board'!$B$2:$P$16,VLOOKUP(Scorekeeping!S163,'Standard Board Scores'!$R:$U,3,FALSE),VLOOKUP(Scorekeeping!S163,'Standard Board Scores'!$R:$U,4,FALSE)),\"\")),\"\")=0,\"\",IFERROR(IF(ISERROR(S163),\"\",IF(OR($D$9=\"Horizontal\",$D$9=\"Single Letter\"),INDEX('Current Board'!$B$2:$P$16,VLOOKUP(Scorekeeping!S163,'Standard Board Scores'!$R:$U,3,FALSE),VLOOKUP(Scorekeeping!S163,'Standard Board Scores'!$R:$U,4,FALSE)),\"\")),\"\")),\"\")","v":""},{"$f":"IF(S164<>\"\",IF(IFERROR(IF(T163=\"\",\"\",IF(OR($D$9=\"Horizontal\",$D$9=\"Single Letter\"),INDEX('Current Board'!$B$2:$P$16,VLOOKUP(Scorekeeping!T163,'Standard Board Scores'!$R:$U,3,FALSE),VLOOKUP(Scorekeeping!T163,'Standard Board Scores'!$R:$U,4,FALSE)),\"\")),\"\")=0,\"\",IFERROR(IF(ISERROR(T163),\"\",IF(OR($D$9=\"Horizontal\",$D$9=\"Single Letter\"),INDEX('Current Board'!$B$2:$P$16,VLOOKUP(Scorekeeping!T163,'Standard Board Scores'!$R:$U,3,FALSE),VLOOKUP(Scorekeeping!T163,'Standard Board Scores'!$R:$U,4,FALSE)),\"\")),\"\")),\"\")","v":""},{"$f":"IF(T164<>\"\",IF(IFERROR(IF(U163=\"\",\"\",IF(OR($D$9=\"Horizontal\",$D$9=\"Single Letter\"),INDEX('Current Board'!$B$2:$P$16,VLOOKUP(Scorekeeping!U163,'Standard Board Scores'!$R:$U,3,FALSE),VLOOKUP(Scorekeeping!U163,'Standard Board Scores'!$R:$U,4,FALSE)),\"\")),\"\")=0,\"\",IFERROR(IF(ISERROR(U163),\"\",IF(OR($D$9=\"Horizontal\",$D$9=\"Single Letter\"),INDEX('Current Board'!$B$2:$P$16,VLOOKUP(Scorekeeping!U163,'Standard Board Scores'!$R:$U,3,FALSE),VLOOKUP(Scorekeeping!U163,'Standard Board Scores'!$R:$U,4,FALSE)),\"\")),\"\")),\"\")","v":""},{"$f":"IF(U164<>\"\",IF(IFERROR(IF(V163=\"\",\"\",IF(OR($D$9=\"Horizontal\",$D$9=\"Single Letter\"),INDEX('Current Board'!$B$2:$P$16,VLOOKUP(Scorekeeping!V163,'Standard Board Scores'!$R:$U,3,FALSE),VLOOKUP(Scorekeeping!V163,'Standard Board Scores'!$R:$U,4,FALSE)),\"\")),\"\")=0,\"\",IFERROR(IF(ISERROR(V163),\"\",IF(OR($D$9=\"Horizontal\",$D$9=\"Single Letter\"),INDEX('Current Board'!$B$2:$P$16,VLOOKUP(Scorekeeping!V163,'Standard Board Scores'!$R:$U,3,FALSE),VLOOKUP(Scorekeeping!V163,'Standard Board Scores'!$R:$U,4,FALSE)),\"\")),\"\")),\"\")","v":""},{"$f":"IF(V164<>\"\",IF(IFERROR(IF(W163=\"\",\"\",IF(OR($D$9=\"Horizontal\",$D$9=\"Single Letter\"),INDEX('Current Board'!$B$2:$P$16,VLOOKUP(Scorekeeping!W163,'Standard Board Scores'!$R:$U,3,FALSE),VLOOKUP(Scorekeeping!W163,'Standard Board Scores'!$R:$U,4,FALSE)),\"\")),\"\")=0,\"\",IFERROR(IF(ISERROR(W163),\"\",IF(OR($D$9=\"Horizontal\",$D$9=\"Single Letter\"),INDEX('Current Board'!$B$2:$P$16,VLOOKUP(Scorekeeping!W163,'Standard Board Scores'!$R:$U,3,FALSE),VLOOKUP(Scorekeeping!W163,'Standard Board Scores'!$R:$U,4,FALSE)),\"\")),\"\")),\"\")","v":""},{"$f":"IF(W164<>\"\",IF(IFERROR(IF(X163=\"\",\"\",IF(OR($D$9=\"Horizontal\",$D$9=\"Single Letter\"),INDEX('Current Board'!$B$2:$P$16,VLOOKUP(Scorekeeping!X163,'Standard Board Scores'!$R:$U,3,FALSE),VLOOKUP(Scorekeeping!X163,'Standard Board Scores'!$R:$U,4,FALSE)),\"\")),\"\")=0,\"\",IFERROR(IF(ISERROR(X163),\"\",IF(OR($D$9=\"Horizontal\",$D$9=\"Single Letter\"),INDEX('Current Board'!$B$2:$P$16,VLOOKUP(Scorekeeping!X163,'Standard Board Scores'!$R:$U,3,FALSE),VLOOKUP(Scorekeeping!X163,'Standard Board Scores'!$R:$U,4,FALSE)),\"\")),\"\")),\"\")","v":""},{"$f":"IF(X164<>\"\",IF(IFERROR(IF(Y163=\"\",\"\",IF(OR($D$9=\"Horizontal\",$D$9=\"Single Letter\"),INDEX('Current Board'!$B$2:$P$16,VLOOKUP(Scorekeeping!Y163,'Standard Board Scores'!$R:$U,3,FALSE),VLOOKUP(Scorekeeping!Y163,'Standard Board Scores'!$R:$U,4,FALSE)),\"\")),\"\")=0,\"\",IFERROR(IF(ISERROR(Y163),\"\",IF(OR($D$9=\"Horizontal\",$D$9=\"Single Letter\"),INDEX('Current Board'!$B$2:$P$16,VLOOKUP(Scorekeeping!Y163,'Standard Board Scores'!$R:$U,3,FALSE),VLOOKUP(Scorekeeping!Y163,'Standard Board Scores'!$R:$U,4,FALSE)),\"\")),\"\")),\"\")","v":""}]
[null,null,null,null,null,null,null,null,null,null,{"$f":"IFERROR(VLOOKUP(K164,'Tiles Remaining'!$A:$C,3,FALSE),\"\")","v":""},{"$f":"IFERROR(VLOOKUP(L164,'Tiles Remaining'!$A:$C,3,FALSE),\"\")","v":""},{"$f":"IFERROR(VLOOKUP(M164,'Tiles Remaining'!$A:$C,3,FALSE),\"\")","v":""},{"$f":"IFERROR(VLOOKUP(N164,'Tiles Remaining'!$A:$C,3,FALSE),\"\")","v":""},{"$f":"IFERROR(VLOOKUP(O164,'Tiles Remaining'!$A:$C,3,FALSE),\"\")","v":""},{"$f":"IFERROR(VLOOKUP(P164,'Tiles Remaining'!$A:$C,3,FALSE),\"\")","v":""},{"$f":"IFERROR(VLOOKUP(Q164,'Tiles Remaining'!$A:$C,3,FALSE),\"\")","v":""},{"$f":"IFERROR(VLOOKUP(R164,'Tiles Remaining'!$A:$C,3,FALSE),\"\")","v":""},{"$f":"IFERROR(VLOOKUP(S164,'Tiles Remaining'!$A:$C,3,FALSE),\"\")","v":""},{"$f":"IFERROR(VLOOKUP(T164,'Tiles Remaining'!$A:$C,3,FALSE),\"\")","v":""},{"$f":"IFERROR(VLOOKUP(U164,'Tiles Remaining'!$A:$C,3,FALSE),\"\")","v":""},{"$f":"IFERROR(VLOOKUP(V164,'Tiles Remaining'!$A:$C,3,FALSE),\"\")","v":""},{"$f":"IFERROR(VLOOKUP(W164,'Tiles Remaining'!$A:$C,3,FALSE),\"\")","v":""},{"$f":"IFERROR(VLOOKUP(X164,'Tiles Remaining'!$A:$C,3,FALSE),\"\")","v":""},{"$f":"IFERROR(VLOOKUP(Y164,'Tiles Remaining'!$A:$C,3,FALSE),\"\")","v":""},{"$f":"SUM(K165:Y165)","v":0},{"$f":"SUM(Z96:Z165)","v":0}]
[null,null,null,null,null,null,null,null,null,null,null,"Horizontal Left"]
[null,null,null,null,null,null,null,null,null,null,null,1,2,3,4,5,6,7,8,9,10,11,12,13,14]
[null,null,null,null,null,null,null,null,null,null,{"$f":"CONCATENATE(D32,E32,F32,G32,H32,I32,J32)","v":""},{"$f":"IF(AND(K168<>\"\",LEFT(K168,1)<>\"B\",LEFT(K168,1)<>\"A\"),CONCATENATE(CHAR(CODE(LEFT(K168,1))-1),REPLACE(K168,1,1,\"\")),\"\")","v":""},{"$f":"IF(AND(L168<>\"\",LEFT(L168,1)<>\"B\",LEFT(L168,1)<>\"A\"),CONCATENATE(CHAR(CODE(LEFT(L168,1))-1),REPLACE(L168,1,1,\"\")),\"\")","v":""},"","","","","","","","","","","",""]
[null,null,null,null,null,null,null,null,null,null,{"$f":"IF(IFERROR(IF(K168=\"\",\"\",IF(OR($D$9=\"Horizontal\",$D$9=\"Single Letter\"),INDEX('Current Board'!$B$2:$P$16,VLOOKUP(Scorekeeping!K168,'Standard Board Scores'!$R:$U,3,FALSE),VLOOKUP(Scorekeeping!K168,'Standard Board Scores'!$R:$U,4,FALSE)),\"\")),\"\")=0,\"\",IFERROR(IF(ISERROR(K168),\"\",IF(OR($D$9=\"Horizontal\",$D$9=\"Single Letter\"),INDEX('Current Board'!$B$2:$P$16,VLOOKUP(Scorekeeping!K168,'Standard Board Scores'!$R:$U,3,FALSE),VLOOKUP(Scorekeeping!K168,'Standard Board Scores'!$R:$U,4,FALSE)),\"\")),\"\"))","v":""},{"$f":"IF(K169<>\"\",IF(IFERROR(IF(L168=\"\",\"\",IF(OR($D$9=\"Horizontal\",$D$9=\"Single Letter\"),INDEX('Current Board'!$B$2:$P$16,VLOOKUP(Scorekeeping!L168,'Standard Board Scores'!$R:$U,3,FALSE),VLOOKUP(Scorekeeping!L168,'Standard Board Scores'!$R:$U,4,FALSE)),\"\")),\"\")=0,\"\",IFERROR(IF(ISERROR(L168),\"\",IF(OR($D$9=\"Horizontal\",$D$9=\"Single Letter\"),INDEX('Current Board'!$B$2:$P$16,VLOOKUP(Scorekeeping!L168,'Standard Board Scores'!$R:$U,3,FALSE),VLOOKUP(Scorekeeping!L168,'Standard Board Scores'!$R:$U,4,FALSE)),\"\")),\"\")),\"\")","v":""},{"$f":"IF(L169<>\"\",IF(IFERROR(IF(M168=\"\",\"\",IF(OR($D$9=\"Horizontal\",$D$9=\"Single Letter\"),INDEX('Current Board'!$B$2:$P$16,VLOOKUP(Scorekeeping!M168,'Standard Board Scores'!$R:$U,3,FALSE),VLOOKUP(Scorekeeping!M168,'Standard Board Scores'!$R:$U,4,FALSE)),\"\")),\"\")=0,\"\",IFERROR(IF(ISERROR(M168),\"\",IF(OR($D$9=\"Horizontal\",$D$9=\"Single Letter\"),INDEX('Current Board'!$B$2:$P$16,VLOOKUP(Scorekeeping!M168,'Standard Board Scores'!$R:$U,3,FALSE),VLOOKUP(Scorekeeping!M168,'Standard Board Scores'!$R:$U,4,FALSE)),\"\")),\"\")),\"\")","v":""},{"$f":"IF(M169<>\"\",IF(IFERROR(IF(N168=\"\",\"\",IF(OR($D$9=\"Horizontal\",$D$9=\"Single Letter\"),INDEX('Current Board'!$B$2:$P$16,VLOOKUP(Scorekeeping!N168,'Standard Board Scores'!$R:$U,3,FALSE),VLOOKUP(Scorekeeping!N168,'Standard Board Scores'!$R:$U,4,FALSE)),\"\")),\"\")=0,\"\",IFERROR(IF(ISERROR(N168),\"\",IF(OR($D$9=\"Horizontal\",$D$9=\"Single Letter\"),INDEX('Current Board'!$B$2:$P$16,VLOOKUP(Scorekeeping!N168,'Standard Board Scores'!$R:$U,3,FALSE),VLOOKUP(Scorekeeping!N168,'Standard Board Scores'!$R:$U,4,FALSE)),\"\")),\"\")),\"\")","v":""},{"$f":"IF(N169<>\"\",IF(IFERROR(IF(O168=\"\",\"\",IF(OR($D$9=\"Horizontal\",$D$9=\"Single Letter\"),INDEX('Current Board'!$B$2:$P$16,VLOOKUP(Scorekeeping!O168,'Standard Board Scores'!$R:$U,3,FALSE),VLOOKUP(Scorekeeping!O168,'Standard Board Scores'!$R:$U,4,FALSE)),\"\")),\"\")=0,\"\",IFERROR(IF(ISERROR(O168),\"\",IF(OR($D$9=\"Horizontal\",$D$9=\"Single Letter\"),INDEX('Current Board'!$B$2:$P$16,VLOOKUP(Scorekeeping!O168,'Standard Board Scores'!$R:$U,3,FALSE),VLOOKUP(Scorekeeping!O168,'Standard Board Scores'!$R:$U,4,FALSE)),\"\")),\"\")),\"\")","v":""},{"$f":"IF(O169<>\"\",IF(IFERROR(IF(P168=\"\",\"\",IF(OR($D$9=\"Horizontal\",$D$9=\"Single Letter\"),INDEX('Current Board'!$B$2:$P$16,VLOOKUP(Scorekeeping!P168,'Standard Board Scores'!$R:$U,3,FALSE),VLOOKUP(Scorekeeping!P168,'Standard Board Scores'!$R:$U,4,FALSE)),\"\")),\"\")=0,\"\",IFERROR(IF(ISERROR(P168),\"\",IF(OR($D$9=\"Horizontal\",$D$9=\"Single Letter\"),INDEX('Current Board'!$B$2:$P$16,VLOOKUP(Scorekeeping!P168,'Standard Board Scores'!$R:$U,3,FALSE),VLOOKUP(Scorekeeping!P168,'Standard Board Scores'!$R:$U,4,FALSE)),\"\")),\"\")),\"\")","v":""},{"$f":"IF(P169<>\"\",IF(IFERROR(IF(Q168=\"\",\"\",IF(OR($D$9=\"Horizontal\",$D$9=\"Single Letter\"),INDEX('Current Board'!$B$2:$P$16,VLOOKUP(Scorekeeping!Q168,'Standard Board Scores'!$R:$U,3,FALSE),VLOOKUP(Scorekeeping!Q168,'Standard Board Scores'!$R:$U,4,FALSE)),\"\")),\"\")=0,\"\",IFERROR(IF(ISERROR(Q168),\"\",IF(OR($D$9=\"Horizontal\",$D$9=\"Single Letter\"),INDEX('Current Board'!$B$2:$P$16,VLOOKUP(Scorekeeping!Q168,'Standard Board Scores'!$R:$U,3,FALSE),VLOOKUP(Scorekeeping!Q168,'Standard Board Scores'!$R:$U,4,FALSE)),\"\")),\"\")),\"\")","v":""},{"$f":"IF(Q169<>\"\",IF(IFERROR(IF(R168=\"\",\"\",IF(OR($D$9=\"Horizontal\",$D$9=\"Single Letter\"),INDEX('Current Board'!$B$2:$P$16,VLOOKUP(Scorekeeping!R168,'Standard Board Scores'!$R:$U,3,FALSE),VLOOKUP(Scorekeeping!R168,'Standard Board Scores'!$R:$U,4,FALSE)),\"\")),\"\")=0,\"\",IFERROR(IF(ISERROR(R168),\"\",IF(OR($D$9=\"Horizontal\",$D$9=\"Single Letter\"),INDEX('Current Board'!$B$2:$P$16,VLOOKUP(Scorekeeping!R168,'Standard Board Scores'!$R:$U,3,FALSE),VLOOKUP(Scorekeeping!R168,'Standard Board Scores'!$R:$U,4,FALSE)),\"\")),\"\")),\"\")","v":""},{"$f":"IF(R169<>\"\",IF(IFERROR(IF(S168=\"\",\"\",IF(OR($D$9=\"Horizontal\",$D$9=\"Single Letter\"),INDEX('Current Board'!$B$2:$P$16,VLOOKUP(Scorekeeping!S168,'Standard Board Scores'!$R:$U,3,FALSE),VLOOKUP(Scorekeeping!S168,'Standard Board Scores'!$R:$U,4,FALSE)),\"\")),\"\")=0,\"\",IFERROR(IF(ISERROR(S168),\"\",IF(OR($D$9=\"Horizontal\",$D$9=\"Single Letter\"),INDEX('Current Board'!$B$2:$P$16,VLOOKUP(Scorekeeping!S168,'Standard Board Scores'!$R:$U,3,FALSE),VLOOKUP(Scorekeeping!S168,'Standard Board Scores'!$R:$U,4,FALSE)),\"\")),\"\")),\"\")","v":""},{"$f":"IF(S169<>\"\",IF(IFERROR(IF(T168=\"\",\"\",IF(OR($D$9=\"Horizontal\",$D$9=\"Single Letter\"),INDEX('Current Board'!$B$2:$P$16,VLOOKUP(Scorekeeping!T168,'Standard Board Scores'!$R:$U,3,FALSE),VLOOKUP(Scorekeeping!T168,'Standard Board Scores'!$R:$U,4,FALSE)),\"\")),\"\")=0,\"\",IFERROR(IF(ISERROR(T168),\"\",IF(OR($D$9=\"Horizontal\",$D$9=\"Single Letter\"),INDEX('Current Board'!$B$2:$P$16,VLOOKUP(Scorekeeping!T168,'Standard Board Scores'!$R:$U,3,FALSE),VLOOKUP(Scorekeeping!T168,'Standard Board Scores'!$R:$U,4,FALSE)),\"\")),\"\")),\"\")","v":""},{"$f":"IF(T169<>\"\",IF(IFERROR(IF(U168=\"\",\"\",IF(OR($D$9=\"Horizontal\",$D$9=\"Single Letter\"),INDEX('Current Board'!$B$2:$P$16,VLOOKUP(Scorekeeping!U168,'Standard Board Scores'!$R:$U,3,FALSE),VLOOKUP(Scorekeeping!U168,'Standard Board Scores'!$R:$U,4,FALSE)),\"\")),\"\")=0,\"\",IFERROR(IF(ISERROR(U168),\"\",IF(OR($D$9=\"Horizontal\",$D$9=\"Single Letter\"),INDEX('Current Board'!$B$2:$P$16,VLOOKUP(Scorekeeping!U168,'Standard Board Scores'!$R:$U,3,FALSE),VLOOKUP(Scorekeeping!U168,'Standard Board Scores'!$R:$U,4,FALSE)),\"\")),\"\")),\"\")","v":""},{"$f":"IF(U169<>\"\",IF(IFERROR(IF(V168=\"\",\"\",IF(OR($D$9=\"Horizontal\",$D$9=\"Single Letter\"),INDEX('Current Board'!$B$2:$P$16,VLOOKUP(Scorekeeping!V168,'Standard Board Scores'!$R:$U,3,FALSE),VLOOKUP(Scorekeeping!V168,'Standard Board Scores'!$R:$U,4,FALSE)),\"\")),\"\")=0,\"\",IFERROR(IF(ISERROR(V168),\"\",IF(OR($D$9=\"Horizontal\",$D$9=\"Single Letter\"),INDEX('Current Board'!$B$2:$P$16,VLOOKUP(Scorekeeping!V168,'Standard Board Scores'!$R:$U,3,FALSE),VLOOKUP(Scorekeeping!V168,'Standard Board Scores'!$R:$U,4,FALSE)),\"\")),\"\")),\"\")","v":""},{"$f":"IF(V169<>\"\",IF(IFERROR(IF(W168=\"\",\"\",IF(OR($D$9=\"Horizontal\",$D$9=\"Single Letter\"),INDEX('Current Board'!$B$2:$P$16,VLOOKUP(Scorekeeping!W168,'Standard Board Scores'!$R:$U,3,FALSE),VLOOKUP(Scorekeeping!W168,'Standard Board Scores'!$R:$U,4,FALSE)),\"\")),\"\")=0,\"\",IFERROR(IF(ISERROR(W168),\"\",IF(OR($D$9=\"Horizontal\",$D$9=\"Single Letter\"),INDEX('Current Board'!$B$2:$P$16,VLOOKUP(Scorekeeping!W168,'Standard Board Scores'!$R:$U,3,FALSE),VLOOKUP(Scorekeeping!W168,'Standard Board Scores'!$R:$U,4,FALSE)),\"\")),\"\")),\"\")","v":""},{"$f":"IF(W169<>\"\",IF(IFERROR(IF(X168=\"\",\"\",IF(OR($D$9=\"Horizontal\",$D$9=\"Single Letter\"),INDEX('Current Board'!$B$2:$P$16,VLOOKUP(Scorekeeping!X168,'Standard Board Scores'!$R:$U,3,FALSE),VLOOKUP(Scorekeeping!X168,'Standard Board Scores'!$R:$U,4,FALSE)),\"\")),\"\")=0,\"\",IFERROR(IF(ISERROR(X168),\"\",IF(OR($D$9=\"Horizontal\",$D$9=\"Single Letter\"),INDEX('Current Board'!$B$2:$P$16,VLOOKUP(Scorekeeping!X168,'Standard Board Scores'!$R:$U,3,FALSE),VLOOKUP(Scorekeeping!X168,'Standard Board Scores'!$R:$U,4,FALSE)),\"\")),\"\")),\"\")","v":""},{"$f":"IF(X169<>\"\",IF(IFERROR(IF(Y168=\"\",\"\",IF(OR($D$9=\"Horizontal\",$D$9=\"Single Letter\"),INDEX('Current Board'!$B$2:$P$16,VLOOKUP(Scorekeeping!Y168,'Standard Board Scores'!$R:$U,3,FALSE),VLOOKUP(Scorekeeping!Y168,'Standard Board Scores'!$R:$U,4,FALSE)),\"\")),\"\")=0,\"\",IFERROR(IF(ISERROR(Y168),\"\",IF(OR($D$9=\"Horizontal\",$D$9=\"Single Letter\"),INDEX('Current Board'!$B$2:$P$16,VLOOKUP(Scorekeeping!Y168,'Standard Board Scores'!$R:$U,3,FALSE),VLOOKUP(Scorekeeping!Y168,'Standard Board Scores'!$R:$U,4,FALSE)),\"\")),\"\")),\"\")","v":""}]
[null,null,null,null,null,null,null,null,null,null,{"$f":"IFERROR(VLOOKUP(K169,'Tiles Remaining'!$A:$C,3,FALSE),\"\")","v":""},{"$f":"IFERROR(VLOOKUP(L169,'Tiles Remaining'!$A:$C,3,FALSE),\"\")","v":""},{"$f":"IFERROR(VLOOKUP(M169,'Tiles Remaining'!$A:$C,3,FALSE),\"\")","v":""},{"$f":"IFERROR(VLOOKUP(N169,'Tiles Remaining'!$A:$C,3,FALSE),\"\")","v":""},{"$f":"IFERROR(VLOOKUP(O169,'Tiles Remaining'!$A:$C,3,FALSE),\"\")","v":""},{"$f":"IFERROR(VLOOKUP(P169,'Tiles Remaining'!$A:$C,3,FALSE),\"\")","v":""},{"$f":"IFERROR(VLOOKUP(Q169,'Tiles Remaining'!$A:$C,3,FALSE),\"\")","v":""},{"$f":"IFERROR(VLOOKUP(R169,'Tiles Remaining'!$A:$C,3,FALSE),\"\")","v":""},{"$f":"IFERROR(VLOOKUP(S169,'Tiles Remaining'!$A:$C,3,FALSE),\"\")","v":""},{"$f":"IFERROR(VLOOKUP(T169,'Tiles Remaining'!$A:$C,3,FALSE),\"\")","v":""},{"$f":"IFERROR(VLOOKUP(U169,'Tiles Remaining'!$A:$C,3,FALSE),\"\")","v":""},{"$f":"IFERROR(VLOOKUP(V169,'Tiles Remaining'!$A:$C,3,FALSE),\"\")","v":""},{"$f":"IFERROR(VLOOKUP(W169,'Tiles Remaining'!$A:$C,3,FALSE),\"\")","v":""},{"$f":"IFERROR(VLOOKUP(X169,'Tiles Remaining'!$A:$C,3,FALSE),\"\")","v":""},{"$f":"IFERROR(VLOOKUP(Y169,'Tiles Remaining'!$A:$C,3,FALSE),\"\")","v":""},{"$f":"SUM(K170:Y170)","v":0}]
[null,null,null,null,null,null,null,null,null,null,null,"Horizontal Right"]
[null,null,null,null,null,null,null,null,null,null,null,1,2,3,4,5,6,7,8,9,10,11,12,13,14]
[null,null,null,null,null,null,null,null,null,null,{"$f":"CONCATENATE(D34,E34,F34,G34,H34,I34,J34)","v":""},{"$f":"IF(AND(K173<>\"\",LEFT(K173,1)<>\"P\",LEFT(K173,1)<>\"Q\"),CONCATENATE(CHAR(CODE(LEFT(K173,1))+1),REPLACE(K173,1,1,\"\")),\"\")","v":""},{"$f":"IF(AND(L173<>\"\",LEFT(L173,1)<>\"P\",LEFT(L173,1)<>\"Q\"),CONCATENATE(CHAR(CODE(LEFT(L173,1))+1),REPLACE(L173,1,1,\"\")),\"\")","v":""},"","","","","","","","","","","",""]
[null,null,null,null,null,null,null,null,null,null,{"$f":"IF(IFERROR(IF(K173=\"\",\"\",IF(OR($D$9=\"Horizontal\",$D$9=\"Single Letter\"),INDEX('Current Board'!$B$2:$P$16,VLOOKUP(Scorekeeping!K173,'Standard Board Scores'!$R:$U,3,FALSE),VLOOKUP(Scorekeeping!K173,'Standard Board Scores'!$R:$U,4,FALSE)),\"\")),\"\")=0,\"\",IFERROR(IF(ISERROR(K173),\"\",IF(OR($D$9=\"Horizontal\",$D$9=\"Single Letter\"),INDEX('Current Board'!$B$2:$P$16,VLOOKUP(Scorekeeping!K173,'Standard Board Scores'!$R:$U,3,FALSE),VLOOKUP(Scorekeeping!K173,'Standard Board Scores'!$R:$U,4,FALSE)),\"\")),\"\"))","v":""},{"$f":"IF(K174<>\"\",IF(IFERROR(IF(L173=\"\",\"\",IF(OR($D$9=\"Horizontal\",$D$9=\"Single Letter\"),INDEX('Current Board'!$B$2:$P$16,VLOOKUP(Scorekeeping!L173,'Standard Board Scores'!$R:$U,3,FALSE),VLOOKUP(Scorekeeping!L173,'Standard Board Scores'!$R:$U,4,FALSE)),\"\")),\"\")=0,\"\",IFERROR(IF(ISERROR(L173),\"\",IF(OR($D$9=\"Horizontal\",$D$9=\"Single Letter\"),INDEX('Current Board'!$B$2:$P$16,VLOOKUP(Scorekeeping!L173,'Standard Board Scores'!$R:$U,3,FALSE),VLOOKUP(Scorekeeping!L173,'Standard Board Scores'!$R:$U,4,FALSE)),\"\")),\"\")),\"\")","v":""},{"$f":"IF(L174<>\"\",IF(IFERROR(IF(M173=\"\",\"\",IF(OR($D$9=\"Horizontal\",$D$9=\"Single Letter\"),INDEX('Current Board'!$B$2:$P$16,VLOOKUP(Scorekeeping!M173,'Standard Board Scores'!$R:$U,3,FALSE),VLOOKUP(Scorekeeping!M173,'Standard Board Scores'!$R:$U,4,FALSE)),\"\")),\"\")=0,\"\",IFERROR(IF(ISERROR(M173),\"\",IF(OR($D$9=\"Horizontal\",$D$9=\"Single Letter\"),INDEX('Current Board'!$B$2:$P$16,VLOOKUP(Scorekeeping!M173,'Standard Board Scores'!$R:$U,3,FALSE),VLOOKUP(Scorekeeping!M173,'Standard Board Scores'!$R:$U,4,FALSE)),\"\")),\"\")),\"\")","v":""},{"$f":"IF(M174<>\"\",IF(IFERROR(IF(N173=\"\",\"\",IF(OR($D$9=\"Horizontal\",$D$9=\"Single Letter\"),INDEX('Current Board'!$B$2:$P$16,VLOOKUP(Scorekeeping!N173,'Standard Board Scores'!$R:$U,3,FALSE),VLOOKUP(Scorekeeping!N173,'Standard Board Scores'!$R:$U,4,FALSE)),\"\")),\"\")=0,\"\",IFERROR(IF(ISERROR(N173),\"\",IF(OR($D$9=\"Horizontal\",$D$9=\"Single Letter\"),INDEX('Current Board'!$B$2:$P$16,VLOOKUP(Scorekeeping!N173,'Standard Board Scores'!$R:$U,3,FALSE),VLOOKUP(Scorekeeping!N173,'Standard Board Scores'!$R:$U,4,FALSE)),\"\")),\"\")),\"\")","v":""},{"$f":"IF(N174<>\"\",IF(IFERROR(IF(O173=\"\",\"\",IF(OR($D$9=\"Horizontal\",$D$9=\"Single Letter\"),INDEX('Current Board'!$B$2:$P$16,VLOOKUP(Scorekeeping!O173,'Standard Board Scores'!$R:$U,3,FALSE),VLOOKUP(Scorekeeping!O173,'Standard Board Scores'!$R:$U,4,FALSE)),\"\")),\"\")=0,\"\",IFERROR(IF(ISERROR(O173),\"\",IF(OR($D$9=\"Horizontal\",$D$9=\"Single Letter\"),INDEX('Current Board'!$B$2:$P$16,VLOOKUP(Scorekeeping!O173,'Standard Board Scores'!$R:$U,3,FALSE),VLOOKUP(Scorekeeping!O173,'Standard Board Scores'!$R:$U,4,FALSE)),\"\")),\"\")),\"\")","v":""},{"$f":"IF(O174<>\"\",IF(IFERROR(IF(P173=\"\",\"\",IF(OR($D$9=\"Horizontal\",$D$9=\"Single Letter\"),INDEX('Current Board'!$B$2:$P$16,VLOOKUP(Scorekeeping!P173,'Standard Board Scores'!$R:$U,3,FALSE),VLOOKUP(Scorekeeping!P173,'Standard Board Scores'!$R:$U,4,FALSE)),\"\")),\"\")=0,\"\",IFERROR(IF(ISERROR(P173),\"\",IF(OR($D$9=\"Horizontal\",$D$9=\"Single Letter\"),INDEX('Current Board'!$B$2:$P$16,VLOOKUP(Scorekeeping!P173,'Standard Board Scores'!$R:$U,3,FALSE),VLOOKUP(Scorekeeping!P173,'Standard Board Scores'!$R:$U,4,FALSE)),\"\")),\"\")),\"\")","v":""},{"$f":"IF(P174<>\"\",IF(IFERROR(IF(Q173=\"\",\"\",IF(OR($D$9=\"Horizontal\",$D$9=\"Single Letter\"),INDEX('Current Board'!$B$2:$P$16,VLOOKUP(Scorekeeping!Q173,'Standard Board Scores'!$R:$U,3,FALSE),VLOOKUP(Scorekeeping!Q173,'Standard Board Scores'!$R:$U,4,FALSE)),\"\")),\"\")=0,\"\",IFERROR(IF(ISERROR(Q173),\"\",IF(OR($D$9=\"Horizontal\",$D$9=\"Single Letter\"),INDEX('Current Board'!$B$2:$P$16,VLOOKUP(Scorekeeping!Q173,'Standard Board Scores'!$R:$U,3,FALSE),VLOOKUP(Scorekeeping!Q173,'Standard Board Scores'!$R:$U,4,FALSE)),\"\")),\"\")),\"\")","v":""},{"$f":"IF(Q174<>\"\",IF(IFERROR(IF(R173=\"\",\"\",IF(OR($D$9=\"Horizontal\",$D$9=\"Single Letter\"),INDEX('Current Board'!$B$2:$P$16,VLOOKUP(Scorekeeping!R173,'Standard Board Scores'!$R:$U,3,FALSE),VLOOKUP(Scorekeeping!R173,'Standard Board Scores'!$R:$U,4,FALSE)),\"\")),\"\")=0,\"\",IFERROR(IF(ISERROR(R173),\"\",IF(OR($D$9=\"Horizontal\",$D$9=\"Single Letter\"),INDEX('Current Board'!$B$2:$P$16,VLOOKUP(Scorekeeping!R173,'Standard Board Scores'!$R:$U,3,FALSE),VLOOKUP(Scorekeeping!R173,'Standard Board Scores'!$R:$U,4,FALSE)),\"\")),\"\")),\"\")","v":""},{"$f":"IF(R174<>\"\",IF(IFERROR(IF(S173=\"\",\"\",IF(OR($D$9=\"Horizontal\",$D$9=\"Single Letter\"),INDEX('Current Board'!$B$2:$P$16,VLOOKUP(Scorekeeping!S173,'Standard Board Scores'!$R:$U,3,FALSE),VLOOKUP(Scorekeeping!S173,'Standard Board Scores'!$R:$U,4,FALSE)),\"\")),\"\")=0,\"\",IFERROR(IF(ISERROR(S173),\"\",IF(OR($D$9=\"Horizontal\",$D$9=\"Single Letter\"),INDEX('Current Board'!$B$2:$P$16,VLOOKUP(Scorekeeping!S173,'Standard Board Scores'!$R:$U,3,FALSE),VLOOKUP(Scorekeeping!S173,'Standard Board Scores'!$R:$U,4,FALSE)),\"\")),\"\")),\"\")","v":""},{"$f":"IF(S174<>\"\",IF(IFERROR(IF(T173=\"\",\"\",IF(OR($D$9=\"Horizontal\",$D$9=\"Single Letter\"),INDEX('Current Board'!$B$2:$P$16,VLOOKUP(Scorekeeping!T173,'Standard Board Scores'!$R:$U,3,FALSE),VLOOKUP(Scorekeeping!T173,'Standard Board Scores'!$R:$U,4,FALSE)),\"\")),\"\")=0,\"\",IFERROR(IF(ISERROR(T173),\"\",IF(OR($D$9=\"Horizontal\",$D$9=\"Single Letter\"),INDEX('Current Board'!$B$2:$P$16,VLOOKUP(Scorekeeping!T173,'Standard Board Scores'!$R:$U,3,FALSE),VLOOKUP(Scorekeeping!T173,'Standard Board Scores'!$R:$U,4,FALSE)),\"\")),\"\")),\"\")","v":""},{"$f":"IF(T174<>\"\",IF(IFERROR(IF(U173=\"\",\"\",IF(OR($D$9=\"Horizontal\",$D$9=\"Single Letter\"),INDEX('Current Board'!$B$2:$P$16,VLOOKUP(Scorekeeping!U173,'Standard Board Scores'!$R:$U,3,FALSE),VLOOKUP(Scorekeeping!U173,'Standard Board Scores'!$R:$U,4,FALSE)),\"\")),\"\")=0,\"\",IFERROR(IF(ISERROR(U173),\"\",IF(OR($D$9=\"Horizontal\",$D$9=\"Single Letter\"),INDEX('Current Board'!$B$2:$P$16,VLOOKUP(Scorekeeping!U173,'Standard Board Scores'!$R:$U,3,FALSE),VLOOKUP(Scorekeeping!U173,'Standard Board Scores'!$R:$U,4,FALSE)),\"\")),\"\")),\"\")","v":""},{"$f":"IF(U174<>\"\",IF(IFERROR(IF(V173=\"\",\"\",IF(OR($D$9=\"Horizontal\",$D$9=\"Single Letter\"),INDEX('Current Board'!$B$2:$P$16,VLOOKUP(Scorekeeping!V173,'Standard Board Scores'!$R:$U,3,FALSE),VLOOKUP(Scorekeeping!V173,'Standard Board Scores'!$R:$U,4,FALSE)),\"\")),\"\")=0,\"\",IFERROR(IF(ISERROR(V173),\"\",IF(OR($D$9=\"Horizontal\",$D$9=\"Single Letter\"),INDEX('Current Board'!$B$2:$P$16,VLOOKUP(Scorekeeping!V173,'Standard Board Scores'!$R:$U,3,FALSE),VLOOKUP(Scorekeeping!V173,'Standard Board Scores'!$R:$U,4,FALSE)),\"\")),\"\")),\"\")","v":""},{"$f":"IF(V174<>\"\",IF(IFERROR(IF(W173=\"\",\"\",IF(OR($D$9=\"Horizontal\",$D$9=\"Single Letter\"),INDEX('Current Board'!$B$2:$P$16,VLOOKUP(Scorekeeping!W173,'Standard Board Scores'!$R:$U,3,FALSE),VLOOKUP(Scorekeeping!W173,'Standard Board Scores'!$R:$U,4,FALSE)),\"\")),\"\")=0,\"\",IFERROR(IF(ISERROR(W173),\"\",IF(OR($D$9=\"Horizontal\",$D$9=\"Single Letter\"),INDEX('Current Board'!$B$2:$P$16,VLOOKUP(Scorekeeping!W173,'Standard Board Scores'!$R:$U,3,FALSE),VLOOKUP(Scorekeeping!W173,'Standard Board Scores'!$R:$U,4,FALSE)),\"\")),\"\")),\"\")","v":""},{"$f":"IF(W174<>\"\",IF(IFERROR(IF(X173=\"\",\"\",IF(OR($D$9=\"Horizontal\",$D$9=\"Single Letter\"),INDEX('Current Board'!$B$2:$P$16,VLOOKUP(Scorekeeping!X173,'Standard Board Scores'!$R:$U,3,FALSE),VLOOKUP(Scorekeeping!X173,'Standard Board Scores'!$R:$U,4,FALSE)),\"\")),\"\")=0,\"\",IFERROR(IF(ISERROR(X173),\"\",IF(OR($D$9=\"Horizontal\",$D$9=\"Single Letter\"),INDEX('Current Board'!$B$2:$P$16,VLOOKUP(Scorekeeping!X173,'Standard Board Scores'!$R:$U,3,FALSE),VLOOKUP(Scorekeeping!X173,'Standard Board Scores'!$R:$U,4,FALSE)),\"\")),\"\")),\"\")","v":""},{"$f":"IF(X174<>\"\",IF(IFERROR(IF(Y173=\"\",\"\",IF(OR($D$9=\"Horizontal\",$D$9=\"Single Letter\"),INDEX('Current Board'!$B$2:$P$16,VLOOKUP(Scorekeeping!Y173,'Standard Board Scores'!$R:$U,3,FALSE),VLOOKUP(Scorekeeping!Y173,'Standard Board Scores'!$R:$U,4,FALSE)),\"\")),\"\")=0,\"\",IFERROR(IF(ISERROR(Y173),\"\",IF(OR($D$9=\"Horizontal\",$D$9=\"Single Letter\"),INDEX('Current Board'!$B$2:$P$16,VLOOKUP(Scorekeeping!Y173,'Standard Board Scores'!$R:$U,3,FALSE),VLOOKUP(Scorekeeping!Y173,'Standard Board Scores'!$R:$U,4,FALSE)),\"\")),\"\")),\"\")","v":""}]
[null,null,null,null,null,null,null,null,null,null,{"$f":"IFERROR(VLOOKUP(K174,'Tiles Remaining'!$A:$C,3,FALSE),\"\")","v":""},{"$f":"IFERROR(VLOOKUP(L174,'Tiles Remaining'!$A:$C,3,FALSE),\"\")","v":""},{"$f":"IFERROR(VLOOKUP(M174,'Tiles Remaining'!$A:$C,3,FALSE),\"\")","v":""},{"$f":"IFERROR(VLOOKUP(N174,'Tiles Remaining'!$A:$C,3,FALSE),\"\")","v":""},{"$f":"IFERROR(VLOOKUP(O174,'Tiles Remaining'!$A:$C,3,FALSE),\"\")","v":""},{"$f":"IFERROR(VLOOKUP(P174,'Tiles Remaining'!$A:$C,3,FALSE),\"\")","v":""},{"$f":"IFERROR(VLOOKUP(Q174,'Tiles Remaining'!$A:$C,3,FALSE),\"\")","v":""},{"$f":"IFERROR(VLOOKUP(R174,'Tiles Remaining'!$A:$C,3,FALSE),\"\")","v":""},{"$f":"IFERROR(VLOOKUP(S174,'Tiles Remaining'!$A:$C,3,FALSE),\"\")","v":""},{"$f":"IFERROR(VLOOKUP(T174,'Tiles Remaining'!$A:$C,3,FALSE),\"\")","v":""},{"$f":"IFERROR(VLOOKUP(U174,'Tiles Remaining'!$A:$C,3,FALSE),\"\")","v":""},{"$f":"IFERROR(VLOOKUP(V174,'Tiles Remaining'!$A:$C,3,FALSE),\"\")","v":""},{"$f":"IFERROR(VLOOKUP(W174,'Tiles Remaining'!$A:$C,3,FALSE),\"\")","v":""},{"$f":"IFERROR(VLOOKUP(X174,'Tiles Remaining'!$A:$C,3,FALSE),\"\")","v":""},{"$f":"IFERROR(VLOOKUP(Y174,'Tiles Remaining'!$A:$C,3,FALSE),\"\")","v":""},{"$f":"SUM(K175:Y175)","v":0}]